{"text_format":"3","workbook":"xlsx","n_sheets":7,"sheets":["表紙","選手入力","リレー入力","リレー印刷用","競技データ","郡市データ","学校データ"],"not_rendered":{"macros":1,"defined_names":1},"read":"whole","date_system":"1900"}

{"sheet":"表紙","index":0,"n_rows":25,"n_cols":2,"rows_kept":25}
["郡市NO",1]
["郡市名（自動表示）",{"$f":"VLOOKUP($B$1,郡市データ!$A$2:$B$18,2,FALSE)","v":"前橋市"}]
["学校NO",5000]
["学校名（自動表示）",{"$f":"VLOOKUP($B$3,学校データ!$C$2:$E$401,3,FALSE)","v":"群馬県立テスト小学校"}]
["学校電話番号","027-123-1234"]
["担当者名","八木橋智幸"]
["担当者メールアドレス","gepra-joho@gepra7.ec-net.jp"]
["担当者電話番号","090-6372-5722"]
[null,"エントリー人数"]
["50m自由形",{"$f":"COUNTIF(選手入力!$F$3:$F$102,表紙!A10)+COUNTIF(選手入力!$L$3:$L$102,表紙!A10)","v":0}]
["50m背泳ぎ",{"$f":"COUNTIF(選手入力!$F$3:$F$102,表紙!A11)+COUNTIF(選手入力!$L$3:$L$102,表紙!A11)","v":0}]
["50m平泳ぎ",{"$f":"COUNTIF(選手入力!$F$3:$F$102,表紙!A12)+COUNTIF(選手入力!$L$3:$L$102,表紙!A12)","v":0}]
["50mバタフライ",{"$f":"COUNTIF(選手入力!$F$3:$F$102,表紙!A13)+COUNTIF(選手入力!$L$3:$L$102,表紙!A13)","v":0}]
["友好レース自由形",{"$f":"COUNTIF(選手入力!$F$3:$F$102,表紙!A14)+COUNTIF(選手入力!$L$3:$L$102,表紙!A14)","v":0}]
["友好レース背泳ぎ",{"$f":"COUNTIF(選手入力!$F$3:$F$102,表紙!A15)+COUNTIF(選手入力!$L$3:$L$102,表紙!A15)","v":0}]
["友好レース平泳ぎ",{"$f":"COUNTIF(選手入力!$F$3:$F$102,表紙!A16)+COUNTIF(選手入力!$L$3:$L$102,表紙!A16)","v":0}]
["友好レースバタフライ",{"$f":"COUNTIF(選手入力!$F$3:$F$102,表紙!A17)+COUNTIF(選手入力!$L$3:$L$102,表紙!A17)","v":0}]
["200mフリーリレー",{"$f":"リレー入力!C28","v":0}]
["200mメドレーリレー",{"$f":"リレー入力!C29","v":0}]
[]
{"$rows_left_out":6}
{"sheet":"選手入力","index":1,"n_rows":102,"n_cols":59,"rows_kept":102,"merged":[[0,0,0,4]]}
[{"$f":"IF(表紙!B4=\"\",\"\",表紙!B4)","v":"群馬県立テスト小学校"},{"$nulls":4},"友好リレーもこちらに",null,null,"申込みタイム（各位ずつ記入）",null,null,"こっちに友好リレーは入れない",null,null,"申込みタイム（各位ずつ記入）"]
["選手NO","漢字氏名","ﾖﾐｶﾞﾅ","学年","性別","種目1","分",null,"秒","1/10","1／100","種目2","分",null,"秒","1/10","1/100",null,"タイム1","タイム2",null,"選手番号(5)","旧日水連ｺｰﾄﾞ(12)","性別(1)","漢字氏名（30）","ｶﾅ氏名(30)","生年月日(8)","学校(1)","学年(1)","ｸﾗｽ(2)","新日水連ｺｰﾄﾞ(7)","所属名1(16)","ｶﾅ所属名1(16)","所属名2(16)","ｶﾅ所属名2(16)","所属名3(16)","ｶﾅ所属名3(16)","使用所属(1)","ｴﾝﾄﾘｰ1(5)","ｴﾝﾄﾘｰﾀｲﾑ1(7)","ｴﾝﾄﾘｰ2(5)","ｴﾝﾄﾘｰﾀｲﾑ2(7)","ｴﾝﾄﾘｰ3(5)","ｴﾝﾄﾘｰﾀｲﾑ3(7)","ｴﾝﾄﾘｰ4(5)","ｴﾝﾄﾘｰﾀｲﾑ4(7)","ｴﾝﾄﾘｰ5(5)","ｴﾝﾄﾘｰﾀｲﾑ5(7)","ｴﾝﾄﾘｰ6(1)","ｴﾝﾄﾘｰﾀｲﾑ6(7)","ｴﾝﾄﾘｰ7(5)","ｴﾝﾄﾘｰﾀｲﾑ7(7)","ｴﾝﾄﾘｰ8(5)","ｴﾝﾄﾘｰﾀｲﾑ8(7)","ｴﾝﾄﾘｰ9(5)","ｴﾝﾄﾘｰﾀｲﾑ9(7)","ｴﾝﾄﾘｰ10(5)","ｴﾝﾄﾘｰﾀｲﾑ10(7)","地域団体ｺｰﾄﾞ(2)"]
[{"$f":"IF(B3=\"\",\"\",表紙!B22)","v":""},{"$nulls":17},{"$f":"G3*100+H3*10+I3+J3*0.1+K3*0.01","v":{"v":0,"d":"0.00"}},{"$f":"M3*100+N3*10+O3+P3*0.1+Q3*0.01","v":{"v":0,"d":"0.00"}},null,{"$f":"IF(A3=\"\",\"\",A3)","v":""},null,{"$f":"IF(E3=\"\",\"\",VLOOKUP(E3,競技データ!$F$2:$G$3,2,FALSE))","v":""},{"$f":"IF(B3=\"\",\"\",B3)","v":""},{"$f":"IF(C3=\"\",\"\",C3)","v":""},null,{"$f":"IF(B3=\"\",\"\",1)","v":""},{"$f":"IF(D3=\"\",\"\",D3)","v":""},{"$f":"IF(F3=\"\",\"\",VLOOKUP(F3,競技データ!$A$2:$C$10,2,FALSE))","v":""},null,{"$f":"IF(B3=\"\",\"\",表紙!$B$23)","v":""},{"$f":"IF(B3=\"\",\"\",表紙!$B$24)","v":""},{"$nulls":4},{"$f":"IF(B3=\"\",\"\",1)","v":""},{"$f":"IF(F3=\"\",\"\",VLOOKUP(F3,競技データ!$A$2:$C$10,3,FALSE))","v":""},{"$f":"IF(F3=\"\",\"\",S3)","v":""},{"$f":"IF(L3=\"\",\"\",VLOOKUP(選手入力!L3,競技データ!$A$2:$C$10,3,FALSE))","v":""},{"$f":"IF(L3=\"\",\"\",T3)","v":""},{"$nulls":16},{"$f":"IF(B3=\"\",\"\",表紙!$B$1)","v":""}]
[{"$f":"IF(B4=\"\",\"\",A3+1)","v":""},{"$nulls":17},{"$f":"G4*100+H4*10+I4+J4*0.1+K4*0.01","v":{"v":0,"d":"0.00"}},{"$f":"M4*100+N4*10+O4+P4*0.1+Q4*0.01","v":{"v":0,"d":"0.00"}},null,{"$f":"IF(A4=\"\",\"\",A4)","v":""},null,{"$f":"IF(E4=\"\",\"\",VLOOKUP(E4,競技データ!$F$2:$G$3,2,FALSE))","v":""},{"$f":"IF(B4=\"\",\"\",B4)","v":""},{"$f":"IF(C4=\"\",\"\",C4)","v":""},null,{"$f":"IF(B4=\"\",\"\",1)","v":""},{"$f":"IF(D4=\"\",\"\",D4)","v":""},{"$f":"IF(F4=\"\",\"\",VLOOKUP(F4,競技データ!$A$2:$C$10,2,FALSE))","v":""},null,{"$f":"IF(B4=\"\",\"\",表紙!$B$23)","v":""},{"$f":"IF(B4=\"\",\"\",表紙!$B$24)","v":""},{"$nulls":4},{"$f":"IF(B4=\"\",\"\",1)","v":""},{"$f":"IF(F4=\"\",\"\",VLOOKUP(F4,競技データ!$A$2:$C$10,3,FALSE))","v":""},{"$f":"IF(F4=\"\",\"\",S4)","v":""},{"$f":"IF(L4=\"\",\"\",VLOOKUP(選手入力!L4,競技データ!$A$2:$C$10,3,FALSE))","v":""},{"$f":"IF(L4=\"\",\"\",T4)","v":""},{"$nulls":16},{"$f":"IF(B4=\"\",\"\",表紙!$B$1)","v":""}]
[{"$f":"IF(B5=\"\",\"\",A4+1)","v":""},{"$nulls":17},{"v":0,"d":"0.00"},{"v":0,"d":"0.00"},null,"",null,{"$f":"IF(E5=\"\",\"\",VLOOKUP(E5,競技データ!$F$2:$G$3,2,FALSE))","v":""},"","",null,"","",{"$f":"IF(F5=\"\",\"\",VLOOKUP(F5,競技データ!$A$2:$C$10,2,FALSE))","v":""},null,{"$f":"IF(B5=\"\",\"\",表紙!$B$23)","v":""},{"$f":"IF(B5=\"\",\"\",表紙!$B$24)","v":""},{"$nulls":4},"",{"$f":"IF(F5=\"\",\"\",VLOOKUP(F5,競技データ!$A$2:$C$10,3,FALSE))","v":""},"",{"$f":"IF(L5=\"\",\"\",VLOOKUP(選手入力!L5,競技データ!$A$2:$C$10,3,FALSE))","v":""},"",{"$nulls":16},{"$f":"IF(B5=\"\",\"\",表紙!$B$1)","v":""}]
["",{"$nulls":17},{"v":0,"d":"0.00"},{"v":0,"d":"0.00"},null,"",null,{"$f":"IF(E6=\"\",\"\",VLOOKUP(E6,競技データ!$F$2:$G$3,2,FALSE))","v":""},"","",null,"","",{"$f":"IF(F6=\"\",\"\",VLOOKUP(F6,競技データ!$A$2:$C$10,2,FALSE))","v":""},null,{"$f":"IF(B6=\"\",\"\",表紙!$B$23)","v":""},{"$f":"IF(B6=\"\",\"\",表紙!$B$24)","v":""},{"$nulls":4},"",{"$f":"IF(F6=\"\",\"\",VLOOKUP(F6,競技データ!$A$2:$C$10,3,FALSE))","v":""},"",{"$f":"IF(L6=\"\",\"\",VLOOKUP(選手入力!L6,競技データ!$A$2:$C$10,3,FALSE))","v":""},"",{"$nulls":16},{"$f":"IF(B6=\"\",\"\",表紙!$B$1)","v":""}]
["",{"$nulls":17},{"v":0,"d":"0.00"},{"v":0,"d":"0.00"},null,"",null,{"$f":"IF(E7=\"\",\"\",VLOOKUP(E7,競技データ!$F$2:$G$3,2,FALSE))","v":""},"","",null,"","",{"$f":"IF(F7=\"\",\"\",VLOOKUP(F7,競技データ!$A$2:$C$10,2,FALSE))","v":""},null,{"$f":"IF(B7=\"\",\"\",表紙!$B$23)","v":""},{"$f":"IF(B7=\"\",\"\",表紙!$B$24)","v":""},{"$nulls":4},"",{"$f":"IF(F7=\"\",\"\",VLOOKUP(F7,競技データ!$A$2:$C$10,3,FALSE))","v":""},"",{"$f":"IF(L7=\"\",\"\",VLOOKUP(選手入力!L7,競技データ!$A$2:$C$10,3,FALSE))","v":""},"",{"$nulls":16},{"$f":"IF(B7=\"\",\"\",表紙!$B$1)","v":""}]
["",{"$nulls":17},{"v":0,"d":"0.00"},{"v":0,"d":"0.00"},null,"",null,{"$f":"IF(E8=\"\",\"\",VLOOKUP(E8,競技データ!$F$2:$G$3,2,FALSE))","v":""},"","",null,"","",{"$f":"IF(F8=\"\",\"\",VLOOKUP(F8,競技データ!$A$2:$C$10,2,FALSE))","v":""},null,{"$f":"IF(B8=\"\",\"\",表紙!$B$23)","v":""},{"$f":"IF(B8=\"\",\"\",表紙!$B$24)","v":""},{"$nulls":4},"",{"$f":"IF(F8=\"\",\"\",VLOOKUP(F8,競技データ!$A$2:$C$10,3,FALSE))","v":""},"",{"$f":"IF(L8=\"\",\"\",VLOOKUP(選手入力!L8,競技データ!$A$2:$C$10,3,FALSE))","v":""},"",{"$nulls":16},{"$f":"IF(B8=\"\",\"\",表紙!$B$1)","v":""}]
["",{"$nulls":17},{"v":0,"d":"0.00"},{"v":0,"d":"0.00"},null,"",null,{"$f":"IF(E9=\"\",\"\",VLOOKUP(E9,競技データ!$F$2:$G$3,2,FALSE))","v":""},"","",null,"","",{"$f":"IF(F9=\"\",\"\",VLOOKUP(F9,競技データ!$A$2:$C$10,2,FALSE))","v":""},null,{"$f":"IF(B9=\"\",\"\",表紙!$B$23)","v":""},{"$f":"IF(B9=\"\",\"\",表紙!$B$24)","v":""},{"$nulls":4},"",{"$f":"IF(F9=\"\",\"\",VLOOKUP(F9,競技データ!$A$2:$C$10,3,FALSE))","v":""},"",{"$f":"IF(L9=\"\",\"\",VLOOKUP(選手入力!L9,競技データ!$A$2:$C$10,3,FALSE))","v":""},"",{"$nulls":16},{"$f":"IF(B9=\"\",\"\",表紙!$B$1)","v":""}]
["",{"$nulls":17},{"v":0,"d":"0.00"},{"v":0,"d":"0.00"},null,"",null,{"$f":"IF(E10=\"\",\"\",VLOOKUP(E10,競技データ!$F$2:$G$3,2,FALSE))","v":""},"","",null,"","",{"$f":"IF(F10=\"\",\"\",VLOOKUP(F10,競技データ!$A$2:$C$10,2,FALSE))","v":""},null,{"$f":"IF(B10=\"\",\"\",表紙!$B$23)","v":""},{"$f":"IF(B10=\"\",\"\",表紙!$B$24)","v":""},{"$nulls":4},"",{"$f":"IF(F10=\"\",\"\",VLOOKUP(F10,競技データ!$A$2:$C$10,3,FALSE))","v":""},"",{"$f":"IF(L10=\"\",\"\",VLOOKUP(選手入力!L10,競技データ!$A$2:$C$10,3,FALSE))","v":""},"",{"$nulls":16},{"$f":"IF(B10=\"\",\"\",表紙!$B$1)","v":""}]
["",{"$nulls":17},{"v":0,"d":"0.00"},{"v":0,"d":"0.00"},null,"",null,{"$f":"IF(E11=\"\",\"\",VLOOKUP(E11,競技データ!$F$2:$G$3,2,FALSE))","v":""},"","",null,"","",{"$f":"IF(F11=\"\",\"\",VLOOKUP(F11,競技データ!$A$2:$C$10,2,FALSE))","v":""},null,{"$f":"IF(B11=\"\",\"\",表紙!$B$23)","v":""},{"$f":"IF(B11=\"\",\"\",表紙!$B$24)","v":""},{"$nulls":4},"",{"$f":"IF(F11=\"\",\"\",VLOOKUP(F11,競技データ!$A$2:$C$10,3,FALSE))","v":""},"",{"$f":"IF(L11=\"\",\"\",VLOOKUP(選手入力!L11,競技データ!$A$2:$C$10,3,FALSE))","v":""},"",{"$nulls":16},{"$f":"IF(B11=\"\",\"\",表紙!$B$1)","v":""}]
["",{"$nulls":17},{"v":0,"d":"0.00"},{"v":0,"d":"0.00"},null,"",null,{"$f":"IF(E12=\"\",\"\",VLOOKUP(E12,競技データ!$F$2:$G$3,2,FALSE))","v":""},"","",null,"","",{"$f":"IF(F12=\"\",\"\",VLOOKUP(F12,競技データ!$A$2:$C$10,2,FALSE))","v":""},null,{"$f":"IF(B12=\"\",\"\",表紙!$B$23)","v":""},{"$f":"IF(B12=\"\",\"\",表紙!$B$24)","v":""},{"$nulls":4},"",{"$f":"IF(F12=\"\",\"\",VLOOKUP(F12,競技データ!$A$2:$C$10,3,FALSE))","v":""},"",{"$f":"IF(L12=\"\",\"\",VLOOKUP(選手入力!L12,競技データ!$A$2:$C$10,3,FALSE))","v":""},"",{"$nulls":16},{"$f":"IF(B12=\"\",\"\",表紙!$B$1)","v":""}]
["",{"$nulls":17},{"v":0,"d":"0.00"},{"v":0,"d":"0.00"},null,"",null,{"$f":"IF(E13=\"\",\"\",VLOOKUP(E13,競技データ!$F$2:$G$3,2,FALSE))","v":""},"","",null,"","",{"$f":"IF(F13=\"\",\"\",VLOOKUP(F13,競技データ!$A$2:$C$10,2,FALSE))","v":""},null,{"$f":"IF(B13=\"\",\"\",表紙!$B$23)","v":""},{"$f":"IF(B13=\"\",\"\",表紙!$B$24)","v":""},{"$nulls":4},"",{"$f":"IF(F13=\"\",\"\",VLOOKUP(F13,競技データ!$A$2:$C$10,3,FALSE))","v":""},"",{"$f":"IF(L13=\"\",\"\",VLOOKUP(選手入力!L13,競技データ!$A$2:$C$10,3,FALSE))","v":""},"",{"$nulls":16},{"$f":"IF(B13=\"\",\"\",表紙!$B$1)","v":""}]
["",{"$nulls":17},{"v":0,"d":"0.00"},{"v":0,"d":"0.00"},null,"",null,{"$f":"IF(E14=\"\",\"\",VLOOKUP(E14,競技データ!$F$2:$G$3,2,FALSE))","v":""},"","",null,"","",{"$f":"IF(F14=\"\",\"\",VLOOKUP(F14,競技データ!$A$2:$C$10,2,FALSE))","v":""},null,{"$f":"IF(B14=\"\",\"\",表紙!$B$23)","v":""},{"$f":"IF(B14=\"\",\"\",表紙!$B$24)","v":""},{"$nulls":4},"",{"$f":"IF(F14=\"\",\"\",VLOOKUP(F14,競技データ!$A$2:$C$10,3,FALSE))","v":""},"",{"$f":"IF(L14=\"\",\"\",VLOOKUP(選手入力!L14,競技データ!$A$2:$C$10,3,FALSE))","v":""},"",{"$nulls":16},{"$f":"IF(B14=\"\",\"\",表紙!$B$1)","v":""}]
["",{"$nulls":17},{"v":0,"d":"0.00"},{"v":0,"d":"0.00"},null,"",null,{"$f":"IF(E15=\"\",\"\",VLOOKUP(E15,競技データ!$F$2:$G$3,2,FALSE))","v":""},"","",null,"","",{"$f":"IF(F15=\"\",\"\",VLOOKUP(F15,競技データ!$A$2:$C$10,2,FALSE))","v":""},null,{"$f":"IF(B15=\"\",\"\",表紙!$B$23)","v":""},{"$f":"IF(B15=\"\",\"\",表紙!$B$24)","v":""},{"$nulls":4},"",{"$f":"IF(F15=\"\",\"\",VLOOKUP(F15,競技データ!$A$2:$C$10,3,FALSE))","v":""},"",{"$f":"IF(L15=\"\",\"\",VLOOKUP(選手入力!L15,競技データ!$A$2:$C$10,3,FALSE))","v":""},"",{"$nulls":16},{"$f":"IF(B15=\"\",\"\",表紙!$B$1)","v":""}]
["",{"$nulls":17},{"v":0,"d":"0.00"},{"v":0,"d":"0.00"},null,"",null,{"$f":"IF(E16=\"\",\"\",VLOOKUP(E16,競技データ!$F$2:$G$3,2,FALSE))","v":""},"","",null,"","",{"$f":"IF(F16=\"\",\"\",VLOOKUP(F16,競技データ!$A$2:$C$10,2,FALSE))","v":""},null,{"$f":"IF(B16=\"\",\"\",表紙!$B$23)","v":""},{"$f":"IF(B16=\"\",\"\",表紙!$B$24)","v":""},{"$nulls":4},"",{"$f":"IF(F16=\"\",\"\",VLOOKUP(F16,競技データ!$A$2:$C$10,3,FALSE))","v":""},"",{"$f":"IF(L16=\"\",\"\",VLOOKUP(選手入力!L16,競技データ!$A$2:$C$10,3,FALSE))","v":""},"",{"$nulls":16},{"$f":"IF(B16=\"\",\"\",表紙!$B$1)","v":""}]
["",{"$nulls":17},{"v":0,"d":"0.00"},{"v":0,"d":"0.00"},null,"",null,{"$f":"IF(E17=\"\",\"\",VLOOKUP(E17,競技データ!$F$2:$G$3,2,FALSE))","v":""},"","",null,"","",{"$f":"IF(F17=\"\",\"\",VLOOKUP(F17,競技データ!$A$2:$C$10,2,FALSE))","v":""},null,{"$f":"IF(B17=\"\",\"\",表紙!$B$23)","v":""},{"$f":"IF(B17=\"\",\"\",表紙!$B$24)","v":""},{"$nulls":4},"",{"$f":"IF(F17=\"\",\"\",VLOOKUP(F17,競技データ!$A$2:$C$10,3,FALSE))","v":""},"",{"$f":"IF(L17=\"\",\"\",VLOOKUP(選手入力!L17,競技データ!$A$2:$C$10,3,FALSE))","v":""},"",{"$nulls":16},{"$f":"IF(B17=\"\",\"\",表紙!$B$1)","v":""}]
["",{"$nulls":17},{"v":0,"d":"0.00"},{"v":0,"d":"0.00"},null,"",null,{"$f":"IF(E18=\"\",\"\",VLOOKUP(E18,競技データ!$F$2:$G$3,2,FALSE))","v":""},"","",null,"","",{"$f":"IF(F18=\"\",\"\",VLOOKUP(F18,競技データ!$A$2:$C$10,2,FALSE))","v":""},null,{"$f":"IF(B18=\"\",\"\",表紙!$B$23)","v":""},{"$f":"IF(B18=\"\",\"\",表紙!$B$24)","v":""},{"$nulls":4},"",{"$f":"IF(F18=\"\",\"\",VLOOKUP(F18,競技データ!$A$2:$C$10,3,FALSE))","v":""},"",{"$f":"IF(L18=\"\",\"\",VLOOKUP(選手入力!L18,競技データ!$A$2:$C$10,3,FALSE))","v":""},"",{"$nulls":16},{"$f":"IF(B18=\"\",\"\",表紙!$B$1)","v":""}]
["",{"$nulls":17},{"v":0,"d":"0.00"},{"v":0,"d":"0.00"},null,"",null,{"$f":"IF(E19=\"\",\"\",VLOOKUP(E19,競技データ!$F$2:$G$3,2,FALSE))","v":""},"","",null,"","",{"$f":"IF(F19=\"\",\"\",VLOOKUP(F19,競技データ!$A$2:$C$10,2,FALSE))","v":""},null,{"$f":"IF(B19=\"\",\"\",表紙!$B$23)","v":""},{"$f":"IF(B19=\"\",\"\",表紙!$B$24)","v":""},{"$nulls":4},"",{"$f":"IF(F19=\"\",\"\",VLOOKUP(F19,競技データ!$A$2:$C$10,3,FALSE))","v":""},"",{"$f":"IF(L19=\"\",\"\",VLOOKUP(選手入力!L19,競技データ!$A$2:$C$10,3,FALSE))","v":""},"",{"$nulls":16},{"$f":"IF(B19=\"\",\"\",表紙!$B$1)","v":""}]
["",{"$nulls":17},{"v":0,"d":"0.00"},{"v":0,"d":"0.00"},null,"",null,{"$f":"IF(E20=\"\",\"\",VLOOKUP(E20,競技データ!$F$2:$G$3,2,FALSE))","v":""},"","",null,"","",{"$f":"IF(F20=\"\",\"\",VLOOKUP(F20,競技データ!$A$2:$C$10,2,FALSE))","v":""},null,{"$f":"IF(B20=\"\",\"\",表紙!$B$23)","v":""},{"$f":"IF(B20=\"\",\"\",表紙!$B$24)","v":""},{"$nulls":4},"",{"$f":"IF(F20=\"\",\"\",VLOOKUP(F20,競技データ!$A$2:$C$10,3,FALSE))","v":""},"",{"$f":"IF(L20=\"\",\"\",VLOOKUP(選手入力!L20,競技データ!$A$2:$C$10,3,FALSE))","v":""},"",{"$nulls":16},{"$f":"IF(B20=\"\",\"\",表紙!$B$1)","v":""}]
{"$rows_left_out":83}
{"sheet":"リレー入力","index":2,"n_rows":29,"n_cols":21,"rows_kept":29,"merged":[[0,1,0,3],[2,4,7,4],[2,5,7,5],[2,6,7,6],[2,7,7,7],[2,8,7,8],[8,4,13,4],[8,5,13,5],[8,6,13,6],[8,7,13,7],[8,8,13,8],[14,4,19,4],[14,5,19,5],[14,6,19,6],[14,7,19,7],[14,8,19,8],[20,4,25,4],[20,5,25,5],[20,6,25,6],[20,7,25,7],[20,8,25,8]]}
[null,{"$f":"IF(表紙!B4=\"\",\"\",表紙!B4)","v":"群馬県立テスト小学校"},{"$nulls":4},"申込みタイム（各位ずつ記入）"]
["種目名","泳順","選手NO","選手名（自動表示）","分",null,"秒","1/10","1／100","タイム","性確認","チーム番号(4)","チーム名(20)","ﾖﾐｶﾞﾅ(15)","所属番号(4)","加盟番号(2)","学校(1)","ｸﾗｽ(2)","性別(1)","ｴﾝﾄﾘｰ(5)","ｴﾝﾄﾘｰﾀｲﾑ(7)"]
["男子200mフリーリレー",1,null,{"$f":"IF(C3=\"\",\"\",VLOOKUP(C3,選手入力!$A$3:$B$102,2,FALSE))","v":""},{"$nulls":5},{"$f":"E3*100+F3*10+G3+H3*0.1+I3*0.01","v":{"v":0,"d":"0.00"}},{"$f":"IF(D3=\"\",\"\",IF(VLOOKUP(D3,選手入力!$B$3:$E$102,4,FALSE)=\"男子\",\"\",\"性別ミス\"))","v":""},{"$f":"IF(C3=\"\",\"\",表紙!$B$25)","v":""},{"$f":"IF(C3=\"\",\"\",表紙!$B$23)","v":""},{"$f":"IF(C3=\"\",\"\",表紙!$B$24)","v":""},null,null,{"$f":"IF($C$3=\"\",\"\",1)","v":""},{"$f":"IF($C$3=\"\",\"\",1)","v":""},{"$f":"IF($C$3=\"\",\"\",1)","v":""},{"$f":"IF($C$3=\"\",\"\",60200)","v":""},{"$f":"IF($C$3=\"\",\"\",J3)","v":""}]
[null,2,null,{"$f":"IF(C4=\"\",\"\",VLOOKUP(C4,選手入力!$A$3:$B$102,2,FALSE))","v":""},{"$nulls":6},{"$f":"IF(D4=\"\",\"\",IF(VLOOKUP(D4,選手入力!$B$3:$E$102,4,FALSE)=\"男子\",\"\",\"性別ミス\"))","v":""},{"$f":"IF(L9=\"\",\"\",L9)","v":""},{"$f":"IF(M9=\"\",\"\",M9)","v":""},"","","","","","","",""]
[null,3,null,{"$f":"IF(C5=\"\",\"\",VLOOKUP(C5,選手入力!$A$3:$B$102,2,FALSE))","v":""},{"$nulls":6},{"$f":"IF(D5=\"\",\"\",IF(VLOOKUP(D5,選手入力!$B$3:$E$102,4,FALSE)=\"男子\",\"\",\"性別ミス\"))","v":""},{"$f":"IF(L15=\"\",\"\",L15)","v":""},{"$f":"IF(M15=\"\",\"\",M15)","v":""},"","","","","","","",""]
[null,4,null,{"$f":"IF(C6=\"\",\"\",VLOOKUP(C6,選手入力!$A$3:$B$102,2,FALSE))","v":""},{"$nulls":6},{"$f":"IF(D6=\"\",\"\",IF(VLOOKUP(D6,選手入力!$B$3:$E$102,4,FALSE)=\"男子\",\"\",\"性別ミス\"))","v":""},{"$f":"IF(L21=\"\",\"\",L21)","v":""},{"$f":"IF(M21=\"\",\"\",M21)","v":""},"","","","","","","",""]
[null,"補員",null,{"$f":"IF(C7=\"\",\"\",VLOOKUP(C7,選手入力!$A$3:$B$102,2,FALSE))","v":""},{"$nulls":6},{"$f":"IF(D7=\"\",\"\",IF(VLOOKUP(D7,選手入力!$B$3:$E$102,4,FALSE)=\"男子\",\"\",\"性別ミス\"))","v":""}]
[null,"補員",null,{"$f":"IF(C8=\"\",\"\",VLOOKUP(C8,選手入力!$A$3:$B$102,2,FALSE))","v":""},{"$nulls":6},{"$f":"IF(D8=\"\",\"\",IF(VLOOKUP(D8,選手入力!$B$3:$E$102,4,FALSE)=\"男子\",\"\",\"性別ミス\"))","v":""}]
["女子200mフリーリレー",1,null,{"$f":"IF(C9=\"\",\"\",VLOOKUP(C9,選手入力!$A$3:$B$102,2,FALSE))","v":""},{"$nulls":5},{"$f":"E9*100+F9*10+G9+H9*0.1+I9*0.01","v":{"v":0,"d":"0.00"}},{"$f":"IF(D9=\"\",\"\",IF(VLOOKUP(D9,選手入力!$B$3:$E$102,4,FALSE)=\"女子\",\"\",\"性別ミス\"))","v":""},{"$f":"IF(C9=\"\",\"\",表紙!$B$25+1)","v":""},{"$f":"IF(C9=\"\",\"\",表紙!$B$23)","v":""},{"$f":"IF(C9=\"\",\"\",表紙!$B$24)","v":""},null,null,{"$f":"IF(C9=\"\",\"\",1)","v":""},{"$f":"IF(C9=\"\",\"\",1)","v":""},{"$f":"IF(C9=\"\",\"\",2)","v":""},{"$f":"IF(C9=\"\",\"\",60200)","v":""},{"$f":"IF(C9=\"\",\"\",J9)","v":""}]
[null,2,null,{"$f":"IF(C10=\"\",\"\",VLOOKUP(C10,選手入力!$A$3:$B$102,2,FALSE))","v":""},{"$nulls":6},{"$f":"IF(D10=\"\",\"\",IF(VLOOKUP(D10,選手入力!$B$3:$E$102,4,FALSE)=\"女子\",\"\",\"性別ミス\"))","v":""}]
[null,3,null,{"$f":"IF(C11=\"\",\"\",VLOOKUP(C11,選手入力!$A$3:$B$102,2,FALSE))","v":""},{"$nulls":6},{"$f":"IF(D11=\"\",\"\",IF(VLOOKUP(D11,選手入力!$B$3:$E$102,4,FALSE)=\"女子\",\"\",\"性別ミス\"))","v":""}]
[null,4,null,{"$f":"IF(C12=\"\",\"\",VLOOKUP(C12,選手入力!$A$3:$B$102,2,FALSE))","v":""},{"$nulls":6},{"$f":"IF(D12=\"\",\"\",IF(VLOOKUP(D12,選手入力!$B$3:$E$102,4,FALSE)=\"女子\",\"\",\"性別ミス\"))","v":""}]
[null,"補員",null,{"$f":"IF(C13=\"\",\"\",VLOOKUP(C13,選手入力!$A$3:$B$102,2,FALSE))","v":""},{"$nulls":6},{"$f":"IF(D13=\"\",\"\",IF(VLOOKUP(D13,選手入力!$B$3:$E$102,4,FALSE)=\"女子\",\"\",\"性別ミス\"))","v":""}]
[null,"補員",null,{"$f":"IF(C14=\"\",\"\",VLOOKUP(C14,選手入力!$A$3:$B$102,2,FALSE))","v":""},{"$nulls":6},{"$f":"IF(D14=\"\",\"\",IF(VLOOKUP(D14,選手入力!$B$3:$E$102,4,FALSE)=\"女子\",\"\",\"性別ミス\"))","v":""}]
["男子200mメドレーリレー","背泳ぎ",null,{"$f":"IF(C15=\"\",\"\",VLOOKUP(C15,選手入力!$A$3:$B$102,2,FALSE))","v":""},{"$nulls":5},{"$f":"E15*100+F15*10+G15+H15*0.1+I15*0.01","v":{"v":0,"d":"0.00"}},{"$f":"IF(D15=\"\",\"\",IF(VLOOKUP(D15,選手入力!$B$3:$E$102,4,FALSE)=\"男子\",\"\",\"性別ミス\"))","v":""},{"$f":"IF(C15=\"\",\"\",表紙!$B$25+2)","v":""},{"$f":"IF(C15=\"\",\"\",表紙!$B$23)","v":""},{"$f":"IF(C15=\"\",\"\",表紙!$B$24)","v":""},null,null,{"$f":"IF(C15=\"\",\"\",1)","v":""},{"$f":"IF(C15=\"\",\"\",1)","v":""},{"$f":"IF(C15=\"\",\"\",1)","v":""},{"$f":"IF(C15=\"\",\"\",70200)","v":""},{"$f":"IF(C15=\"\",\"\",J15)","v":""}]
[null,"平泳ぎ",null,{"$f":"IF(C16=\"\",\"\",VLOOKUP(C16,選手入力!$A$3:$B$102,2,FALSE))","v":""},{"$nulls":6},{"$f":"IF(D16=\"\",\"\",IF(VLOOKUP(D16,選手入力!$B$3:$E$102,4,FALSE)=\"男子\",\"\",\"性別ミス\"))","v":""}]
[null,"バタフライ",null,{"$f":"IF(C17=\"\",\"\",VLOOKUP(C17,選手入力!$A$3:$B$102,2,FALSE))","v":""},{"$nulls":6},{"$f":"IF(D17=\"\",\"\",IF(VLOOKUP(D17,選手入力!$B$3:$E$102,4,FALSE)=\"男子\",\"\",\"性別ミス\"))","v":""}]
[null,"自由形",null,{"$f":"IF(C18=\"\",\"\",VLOOKUP(C18,選手入力!$A$3:$B$102,2,FALSE))","v":""},{"$nulls":6},{"$f":"IF(D18=\"\",\"\",IF(VLOOKUP(D18,選手入力!$B$3:$E$102,4,FALSE)=\"男子\",\"\",\"性別ミス\"))","v":""}]
[null,"補員",null,{"$f":"IF(C19=\"\",\"\",VLOOKUP(C19,選手入力!$A$3:$B$102,2,FALSE))","v":""},{"$nulls":6},{"$f":"IF(D19=\"\",\"\",IF(VLOOKUP(D19,選手入力!$B$3:$E$102,4,FALSE)=\"男子\",\"\",\"性別ミス\"))","v":""}]
[null,"補員",null,{"$f":"IF(C20=\"\",\"\",VLOOKUP(C20,選手入力!$A$3:$B$102,2,FALSE))","v":""},{"$nulls":6},{"$f":"IF(D20=\"\",\"\",IF(VLOOKUP(D20,選手入力!$B$3:$E$102,4,FALSE)=\"男子\",\"\",\"性別ミス\"))","v":""}]
{"$rows_left_out":10}
{"sheet":"リレー印刷用","index":3,"n_rows":26,"n_cols":4,"rows_kept":26,"merged":[[0,1,0,3]]}
[null,{"$f":"IF(表紙!B4=\"\",\"\",表紙!B4)","v":"群馬県立テスト小学校"}]
["種目名","泳順","選手NO","選手名（自動表示）"]
["男子200mフリーリレー",1,{"$f":"IF(リレー入力!C3=\"\",\"\",リレー入力!C3)","v":""},{"$f":"IF(リレー入力!D3=\"\",\"\",リレー入力!D3)","v":""}]
["　　組　　レーン",2,{"$f":"IF(リレー入力!C4=\"\",\"\",リレー入力!C4)","v":""},{"$f":"IF(リレー入力!D4=\"\",\"\",リレー入力!D4)","v":""}]
[null,3,{"$f":"IF(リレー入力!C5=\"\",\"\",リレー入力!C5)","v":""},{"$f":"IF(リレー入力!D5=\"\",\"\",リレー入力!D5)","v":""}]
[null,4,{"$f":"IF(リレー入力!C6=\"\",\"\",リレー入力!C6)","v":""},{"$f":"IF(リレー入力!D6=\"\",\"\",リレー入力!D6)","v":""}]
[null,"補員",{"$f":"IF(リレー入力!C7=\"\",\"\",リレー入力!C7)","v":""},{"$f":"IF(リレー入力!D7=\"\",\"\",リレー入力!D7)","v":""}]
[null,"補員",{"$f":"IF(リレー入力!C8=\"\",\"\",リレー入力!C8)","v":""},{"$f":"IF(リレー入力!D8=\"\",\"\",リレー入力!D8)","v":""}]
["女子200mフリーリレー",1,{"$f":"IF(リレー入力!C9=\"\",\"\",リレー入力!C9)","v":""},{"$f":"IF(リレー入力!D9=\"\",\"\",リレー入力!D9)","v":""}]
["　　組　　レーン",2,{"$f":"IF(リレー入力!C10=\"\",\"\",リレー入力!C10)","v":""},{"$f":"IF(リレー入力!D10=\"\",\"\",リレー入力!D10)","v":""}]
[null,3,{"$f":"IF(リレー入力!C11=\"\",\"\",リレー入力!C11)","v":""},{"$f":"IF(リレー入力!D11=\"\",\"\",リレー入力!D11)","v":""}]
[null,4,{"$f":"IF(リレー入力!C12=\"\",\"\",リレー入力!C12)","v":""},{"$f":"IF(リレー入力!D12=\"\",\"\",リレー入力!D12)","v":""}]
[null,"補員",{"$f":"IF(リレー入力!C13=\"\",\"\",リレー入力!C13)","v":""},{"$f":"IF(リレー入力!D13=\"\",\"\",リレー入力!D13)","v":""}]
[null,"補員",{"$f":"IF(リレー入力!C14=\"\",\"\",リレー入力!C14)","v":""},{"$f":"IF(リレー入力!D14=\"\",\"\",リレー入力!D14)","v":""}]
["男子200mメドレーリレー","背泳ぎ",{"$f":"IF(リレー入力!C15=\"\",\"\",リレー入力!C15)","v":""},{"$f":"IF(リレー入力!D15=\"\",\"\",リレー入力!D15)","v":""}]
["　　組　　レーン","平泳ぎ",{"$f":"IF(リレー入力!C16=\"\",\"\",リレー入力!C16)","v":""},{"$f":"IF(リレー入力!D16=\"\",\"\",リレー入力!D16)","v":""}]
[null,"バタフライ",{"$f":"IF(リレー入力!C17=\"\",\"\",リレー入力!C17)","v":""},{"$f":"IF(リレー入力!D17=\"\",\"\",リレー入力!D17)","v":""}]
[null,"自由形",{"$f":"IF(リレー入力!C18=\"\",\"\",リレー入力!C18)","v":""},{"$f":"IF(リレー入力!D18=\"\",\"\",リレー入力!D18)","v":""}]
[null,"補員",{"$f":"IF(リレー入力!C19=\"\",\"\",リレー入力!C19)","v":""},{"$f":"IF(リレー入力!D19=\"\",\"\",リレー入力!D19)","v":""}]
[null,"補員",{"$f":"IF(リレー入力!C20=\"\",\"\",リレー入力!C20)","v":""},{"$f":"IF(リレー入力!D20=\"\",\"\",リレー入力!D20)","v":""}]
{"$rows_left_out":7}
{"sheet":"競技データ","index":4,"n_rows":10,"n_cols":7,"rows_kept":10}
["種目名","クラス","コード",null,"学年","性別"]
["50m自由形",1,10050,null,4,"男子",1]
["50m背泳ぎ",1,20050,null,5,"女子",2]
["50m平泳ぎ",1,30050,null,6]
["50mバタフライ",1,40050]
["友好レース自由形",2,10050]
["友好レース背泳ぎ",2,20050]
["友好レース平泳ぎ",2,30050]
["友好レースバタフライ",2,40050]
["リレーのみ",1]

{"sheet":"郡市データ","index":5,"n_rows":23,"n_cols":9,"rows_kept":23}
["郡市番号","郡市名","学校数","学校番号初期値","選手番号初期値","チーム番号初期値"]
[1,"前橋市",47,100101,1001,101,null,"前橋",{"$f":"PHONETIC(H2)","v":"ﾏｴﾊﾞｼ"}]
[2,"伊勢崎市",23,100201,2001,201,null,"伊勢崎",{"$f":"PHONETIC(H3)","v":"ｲｾｻｷ"}]
[3,"佐波郡",6,100301,3001,301,null,"佐波","ｻﾜ"]
[4,"北群馬郡",4,100401,4001,401,null,"北群馬","ｷﾀｸﾞﾝﾏ"]
[5,"渋川市",14,100501,5001,501,null,"渋川","ｼﾌﾞｶﾜ"]
[6,"利根郡",11,100601,6001,601,null,"利根","ﾄﾈ"]
[7,"沼田市",11,100701,7001,701,null,"沼田","ﾇﾏﾀ"]
[8,"吾妻郡",14,100801,8001,801,null,"吾妻","ｱｶﾞﾂﾏ"]
[9,"高崎市",58,100901,9001,901,null,"高崎","ﾀｶｻｷ"]
[10,"安中市",12,101001,10001,1001,null,"安中","ｱﾝﾅｶ"]
[11,"甘楽・富岡",16,101101,11001,1101,null,"甘・富","ｶﾝﾗﾄﾐｵｶ"]
[12,"藤岡・多野",13,101201,12001,1201,null,"藤・多","ﾌｼﾞｵｶﾀﾉ"]
[13,"桐生市",17,101301,13001,1301,null,"桐生","ｷﾘｭｳ"]
[14,"みどり市",7,101401,14001,1401,null,"みどり","ﾐﾄﾞﾘ"]
[15,"太田市",25,101501,15001,1501,null,"太田","ｵｵﾀ"]
[16,"邑楽郡",14,101601,16001,1601,null,"邑楽","ｵｳﾗ"]
[17,"館林市",11,101701,17001,1701,null,"館林","ﾀﾃﾊﾞﾔｼ"]
[]
[]
{"$rows_left_out":4}
{"sheet":"学校データ","index":6,"n_rows":336,"n_cols":9,"rows_kept":336}
["郡市名","№","学校コード\n申し込みには\nこのｺｰﾄﾞを\n入力","MCコード","学校名","略称","ﾖﾐｶﾞﾅ","リレーNO初期値","選手NO初期値"]
["０１",1,101,100101,"前橋市立桃井小学校","前・桃井","ﾏｴﾊﾞｼ.ﾓﾓﾉｲ",1,1]
["前橋市",2,102,100102,"前橋市立中川小学校","前・中川","ﾏｴﾊﾞｼ.ﾅｶｶﾞﾜ",6,51]
[null,3,103,100103,"前橋市立敷島小学校","前・敷島","ﾏｴﾊﾞｼ.ｼｷｼﾏ",11,101]
[null,4,104,100104,"前橋市立城南小学校","前・城南","ﾏｴﾊﾞｼ.ｼﾞｮｳﾅﾝ",16,151]
[null,5,105,100105,"前橋市立城東小学校","前・城東","ﾏｴﾊﾞｼ.ｼﾞｮｳﾄｳ",21,201]
[null,6,106,100106,"前橋市立若宮小学校","前・若宮","ﾏｴﾊﾞｼ.ﾜｶﾐﾔ",26,251]
[null,7,107,100107,"前橋市立天川小学校","前・天川","ﾏｴﾊﾞｼ.ｱﾏｶﾞﾜ",31,301]
[null,8,108,100108,"前橋市立岩神小学校","前・岩神","ﾏｴﾊﾞｼ.ｲﾜｶﾞﾐ",36,351]
[null,9,null,"","","","",41,401]
[null,10,110,100110,"前橋市立広瀬小学校","前・広瀬","ﾏｴﾊﾞｼ.ﾋﾛｾ",46,451]
[null,11,111,100111,"前橋市立山王小学校","前・山王","ﾏｴﾊﾞｼ.ｻﾝﾉｳ",51,501]
[null,12,112,100112,"前橋市立わかば小学校","前・わかば","ﾏｴﾊﾞｼ.ﾜｶﾊﾞ",56,551]
[null,13,null,"","","","",61,601]
[null,14,114,100114,"前橋市立上川淵小学校","前・上川淵","ﾏｴﾊﾞｼ.ｶﾐｶﾜﾌﾁ",66,651]
[null,15,115,100115,"前橋市立下川淵小学校","前・下川淵","ﾏｴﾊﾞｼ.ｼﾓｶﾜﾌﾁ",71,701]
[null,16,116,100116,"前橋市立桂萱小学校","前・桂萱","ﾏｴﾊﾞｼ.ｶｲｶﾞﾔ",76,751]
[null,17,117,100117,"前橋市立桃木小学校","前・桃木","ﾏｴﾊﾞｼ.ﾓﾓﾉｷ",81,801]
[null,18,118,100118,"前橋市立桂萱東小学校","前・桂萱東","ﾏｴﾊﾞｼ.ｶｲｶﾞﾔﾋｶﾞｼ",86,851]
[null,19,119,100119,"前橋市立桃瀬小学校","前・桃瀬","ﾏｴﾊﾞｼ.ﾓﾓﾉｾ",91,901]
{"$rows_left_out":316}