{"text_format":"3","workbook":"xlsx","n_sheets":6,"sheets":["表紙","選手入力","リレー入力","競技データ","郡市データ","学校データ"],"not_rendered":{"macros":1,"defined_names":1},"read":"whole","date_system":"1900"}

{"sheet":"表紙","index":0,"n_rows":21,"n_cols":2,"rows_kept":21}
["郡市NO",1]
["郡市名（自動表示）",{"$f":"VLOOKUP($B$1,郡市データ!$A$2:$B$18,2,FALSE)","v":"前橋市"}]
["学校電話番号","027-123-1234"]
["担当者名","群馬　太郎"]
["担当者メールアドレス","gepra-joho@gepra7.ec-net.jp"]
["担当者電話番号","027-123-4567"]
[null,"エントリー人数"]
["50m自由形",{"$f":"COUNTIF(選手入力!$H$3:$H$202,表紙!A8)","v":0}]
["50m背泳ぎ",{"$f":"COUNTIF(選手入力!$H$3:$H$202,表紙!A9)","v":0}]
["50m平泳ぎ",{"$f":"COUNTIF(選手入力!$H$3:$H$202,表紙!A10)","v":0}]
["50mバタフライ",{"$f":"COUNTIF(選手入力!$H$3:$H$202,表紙!A11)","v":0}]
["友好レース自由形",{"$f":"COUNTIF(選手入力!$H$3:$H$202,表紙!A12)","v":0}]
["友好レース背泳ぎ",{"$f":"COUNTIF(選手入力!$H$3:$H$202,表紙!A13)","v":0}]
["友好レース平泳ぎ",{"$f":"COUNTIF(選手入力!$H$3:$H$202,表紙!A14)","v":0}]
["友好レースバタフライ",{"$f":"COUNTIF(選手入力!$H$3:$H$202,表紙!A15)","v":0}]
["200mフリーリレー",{"$f":"リレー入力!B84","v":0}]
["200mメドレーリレー",{"$f":"リレー入力!B85","v":0}]
[]
["以下処理用"]
["選手NO初期NO",{"$f":"IF(B2=\"\",\"\",VLOOKUP(B2,郡市データ!$B$2:$F$18,4,FALSE))","v":1001}]
{"$rows_left_out":2}
{"sheet":"選手入力","index":1,"n_rows":202,"n_cols":54,"rows_kept":202,"merged":[[0,0,0,4],[0,8,0,12]]}
[{"$f":"IF(表紙!B2=\"\",\"\",表紙!B2 & \"選手入力\")","v":"前橋市選手入力"},{"$nulls":6},"友好リレーもこちらに","申込みタイム（各位ずつ記入）"]
["選手NO","漢字氏名","ﾖﾐｶﾞﾅ","学年","性別","学校NO","学校名（自動表示）","種目1","分",null,"秒","1/10","1／100",null,"タイム1",null,"選手番号(5)","旧日水連ｺｰﾄﾞ(12)","性別(1)","漢字氏名（30）","ｶﾅ氏名(30)","生年月日(8)","学校(1)","学年(1)","ｸﾗｽ(2)","新日水連ｺｰﾄﾞ(7)","所属名1(16)","ｶﾅ所属名1(16)","所属名2(16)","ｶﾅ所属名2(16)","所属名3(16)","ｶﾅ所属名3(16)","使用所属(1)","ｴﾝﾄﾘｰ1(5)","ｴﾝﾄﾘｰﾀｲﾑ1(7)","ｴﾝﾄﾘｰ2(5)","ｴﾝﾄﾘｰﾀｲﾑ2(7)","ｴﾝﾄﾘｰ3(5)","ｴﾝﾄﾘｰﾀｲﾑ3(7)","ｴﾝﾄﾘｰ4(5)","ｴﾝﾄﾘｰﾀｲﾑ4(7)","ｴﾝﾄﾘｰ5(5)","ｴﾝﾄﾘｰﾀｲﾑ5(7)","ｴﾝﾄﾘｰ6(1)","ｴﾝﾄﾘｰﾀｲﾑ6(7)","ｴﾝﾄﾘｰ7(5)","ｴﾝﾄﾘｰﾀｲﾑ7(7)","ｴﾝﾄﾘｰ8(5)","ｴﾝﾄﾘｰﾀｲﾑ8(7)","ｴﾝﾄﾘｰ9(5)","ｴﾝﾄﾘｰﾀｲﾑ9(7)","ｴﾝﾄﾘｰ10(5)","ｴﾝﾄﾘｰﾀｲﾑ10(7)","地域団体ｺｰﾄﾞ(2)"]
[{"$f":"IF(B3=\"\",\"\",表紙!B20)","v":""},{"$nulls":5},{"$f":"IF(F3=\"\",\"\",VLOOKUP(F3,学校データ!C:G,4,FALSE))","v":""},{"$nulls":7},{"$f":"I3*100+J3*10+K3+L3*0.1+M3*0.01","v":{"v":0,"d":"0.00"}},null,{"$f":"IF(A3=\"\",\"\",A3)","v":""},null,{"$f":"IF(E3=\"\",\"\",VLOOKUP(E3,競技データ!$F$2:$G$3,2,FALSE))","v":""},{"$f":"IF(B3=\"\",\"\",B3)","v":""},{"$f":"IF(C3=\"\",\"\",C3)","v":""},null,{"$f":"IF(B3=\"\",\"\",1)","v":""},{"$f":"IF(D3=\"\",\"\",D3)","v":""},{"$f":"IF(H3=\"\",\"\",VLOOKUP(H3,競技データ!$A$2:$C$10,2,FALSE))","v":""},null,{"$f":"IF(G3=\"\",\"\",G3)","v":""},{"$f":"IF(AA3=\"\",\"\",VLOOKUP(AA3,学校データ!F:G,2,FALSE))","v":""},{"$nulls":4},{"$f":"IF(B3=\"\",\"\",1)","v":""},{"$f":"IF(H3=\"\",\"\",VLOOKUP(H3,競技データ!$A$2:$C$10,3,FALSE))","v":""},{"$f":"IF(H3=\"\",\"\",O3)","v":""},{"$nulls":18},{"$f":"IF(B3=\"\",\"\",表紙!$B$1)","v":""}]
[{"$f":"IF(B4=\"\",\"\",A3+1)","v":""},{"$nulls":5},{"$f":"IF(F4=\"\",\"\",VLOOKUP(F4,学校データ!C:G,4,FALSE))","v":""},{"$nulls":7},{"v":0,"d":"0.00"},null,"",null,{"$f":"IF(E4=\"\",\"\",VLOOKUP(E4,競技データ!$F$2:$G$3,2,FALSE))","v":""},"","",null,"","",{"$f":"IF(H4=\"\",\"\",VLOOKUP(H4,競技データ!$A$2:$C$10,2,FALSE))","v":""},null,{"$f":"IF(G4=\"\",\"\",G4)","v":""},{"$f":"IF(AA4=\"\",\"\",VLOOKUP(AA4,学校データ!F:G,2,FALSE))","v":""},{"$nulls":4},"",{"$f":"IF(H4=\"\",\"\",VLOOKUP(H4,競技データ!$A$2:$C$10,3,FALSE))","v":""},"",{"$nulls":18},{"$f":"IF(B4=\"\",\"\",表紙!$B$1)","v":""}]
[{"$f":"IF(B5=\"\",\"\",A4+1)","v":""},{"$nulls":5},{"$f":"IF(F5=\"\",\"\",VLOOKUP(F5,学校データ!C:G,4,FALSE))","v":""},{"$nulls":7},{"v":0,"d":"0.00"},null,"",null,{"$f":"IF(E5=\"\",\"\",VLOOKUP(E5,競技データ!$F$2:$G$3,2,FALSE))","v":""},"","",null,"","",{"$f":"IF(H5=\"\",\"\",VLOOKUP(H5,競技データ!$A$2:$C$10,2,FALSE))","v":""},null,"",{"$f":"IF(AA5=\"\",\"\",VLOOKUP(AA5,学校データ!F:G,2,FALSE))","v":""},{"$nulls":4},"",{"$f":"IF(H5=\"\",\"\",VLOOKUP(H5,競技データ!$A$2:$C$10,3,FALSE))","v":""},"",{"$nulls":18},{"$f":"IF(B5=\"\",\"\",表紙!$B$1)","v":""}]
["",{"$nulls":5},{"$f":"IF(F6=\"\",\"\",VLOOKUP(F6,学校データ!C:G,4,FALSE))","v":""},{"$nulls":7},{"v":0,"d":"0.00"},null,"",null,{"$f":"IF(E6=\"\",\"\",VLOOKUP(E6,競技データ!$F$2:$G$3,2,FALSE))","v":""},"","",null,"","",{"$f":"IF(H6=\"\",\"\",VLOOKUP(H6,競技データ!$A$2:$C$10,2,FALSE))","v":""},null,"",{"$f":"IF(AA6=\"\",\"\",VLOOKUP(AA6,学校データ!F:G,2,FALSE))","v":""},{"$nulls":4},"",{"$f":"IF(H6=\"\",\"\",VLOOKUP(H6,競技データ!$A$2:$C$10,3,FALSE))","v":""},"",{"$nulls":18},{"$f":"IF(B6=\"\",\"\",表紙!$B$1)","v":""}]
["",{"$nulls":5},{"$f":"IF(F7=\"\",\"\",VLOOKUP(F7,学校データ!C:G,4,FALSE))","v":""},{"$nulls":7},{"v":0,"d":"0.00"},null,"",null,{"$f":"IF(E7=\"\",\"\",VLOOKUP(E7,競技データ!$F$2:$G$3,2,FALSE))","v":""},"","",null,"","",{"$f":"IF(H7=\"\",\"\",VLOOKUP(H7,競技データ!$A$2:$C$10,2,FALSE))","v":""},null,"",{"$f":"IF(AA7=\"\",\"\",VLOOKUP(AA7,学校データ!F:G,2,FALSE))","v":""},{"$nulls":4},"",{"$f":"IF(H7=\"\",\"\",VLOOKUP(H7,競技データ!$A$2:$C$10,3,FALSE))","v":""},"",{"$nulls":18},{"$f":"IF(B7=\"\",\"\",表紙!$B$1)","v":""}]
["",{"$nulls":5},{"$f":"IF(F8=\"\",\"\",VLOOKUP(F8,学校データ!C:G,4,FALSE))","v":""},{"$nulls":7},{"v":0,"d":"0.00"},null,"",null,{"$f":"IF(E8=\"\",\"\",VLOOKUP(E8,競技データ!$F$2:$G$3,2,FALSE))","v":""},"","",null,"","",{"$f":"IF(H8=\"\",\"\",VLOOKUP(H8,競技データ!$A$2:$C$10,2,FALSE))","v":""},null,"",{"$f":"IF(AA8=\"\",\"\",VLOOKUP(AA8,学校データ!F:G,2,FALSE))","v":""},{"$nulls":4},"",{"$f":"IF(H8=\"\",\"\",VLOOKUP(H8,競技データ!$A$2:$C$10,3,FALSE))","v":""},"",{"$nulls":18},{"$f":"IF(B8=\"\",\"\",表紙!$B$1)","v":""}]
["",{"$nulls":5},{"$f":"IF(F9=\"\",\"\",VLOOKUP(F9,学校データ!C:G,4,FALSE))","v":""},{"$nulls":7},{"v":0,"d":"0.00"},null,"",null,{"$f":"IF(E9=\"\",\"\",VLOOKUP(E9,競技データ!$F$2:$G$3,2,FALSE))","v":""},"","",null,"","",{"$f":"IF(H9=\"\",\"\",VLOOKUP(H9,競技データ!$A$2:$C$10,2,FALSE))","v":""},null,"",{"$f":"IF(AA9=\"\",\"\",VLOOKUP(AA9,学校データ!F:G,2,FALSE))","v":""},{"$nulls":4},"",{"$f":"IF(H9=\"\",\"\",VLOOKUP(H9,競技データ!$A$2:$C$10,3,FALSE))","v":""},"",{"$nulls":18},{"$f":"IF(B9=\"\",\"\",表紙!$B$1)","v":""}]
["",{"$nulls":5},{"$f":"IF(F10=\"\",\"\",VLOOKUP(F10,学校データ!C:G,4,FALSE))","v":""},{"$nulls":7},{"v":0,"d":"0.00"},null,"",null,{"$f":"IF(E10=\"\",\"\",VLOOKUP(E10,競技データ!$F$2:$G$3,2,FALSE))","v":""},"","",null,"","",{"$f":"IF(H10=\"\",\"\",VLOOKUP(H10,競技データ!$A$2:$C$10,2,FALSE))","v":""},null,"",{"$f":"IF(AA10=\"\",\"\",VLOOKUP(AA10,学校データ!F:G,2,FALSE))","v":""},{"$nulls":4},"",{"$f":"IF(H10=\"\",\"\",VLOOKUP(H10,競技データ!$A$2:$C$10,3,FALSE))","v":""},"",{"$nulls":18},{"$f":"IF(B10=\"\",\"\",表紙!$B$1)","v":""}]
["",{"$nulls":5},{"$f":"IF(F11=\"\",\"\",VLOOKUP(F11,学校データ!C:G,4,FALSE))","v":""},{"$nulls":7},{"v":0,"d":"0.00"},null,"",null,{"$f":"IF(E11=\"\",\"\",VLOOKUP(E11,競技データ!$F$2:$G$3,2,FALSE))","v":""},"","",null,"","",{"$f":"IF(H11=\"\",\"\",VLOOKUP(H11,競技データ!$A$2:$C$10,2,FALSE))","v":""},null,"",{"$f":"IF(AA11=\"\",\"\",VLOOKUP(AA11,学校データ!F:G,2,FALSE))","v":""},{"$nulls":4},"",{"$f":"IF(H11=\"\",\"\",VLOOKUP(H11,競技データ!$A$2:$C$10,3,FALSE))","v":""},"",{"$nulls":18},{"$f":"IF(B11=\"\",\"\",表紙!$B$1)","v":""}]
["",{"$nulls":5},{"$f":"IF(F12=\"\",\"\",VLOOKUP(F12,学校データ!C:G,4,FALSE))","v":""},{"$nulls":7},{"v":0,"d":"0.00"},null,"",null,{"$f":"IF(E12=\"\",\"\",VLOOKUP(E12,競技データ!$F$2:$G$3,2,FALSE))","v":""},"","",null,"","",{"$f":"IF(H12=\"\",\"\",VLOOKUP(H12,競技データ!$A$2:$C$10,2,FALSE))","v":""},null,"",{"$f":"IF(AA12=\"\",\"\",VLOOKUP(AA12,学校データ!F:G,2,FALSE))","v":""},{"$nulls":4},"",{"$f":"IF(H12=\"\",\"\",VLOOKUP(H12,競技データ!$A$2:$C$10,3,FALSE))","v":""},"",{"$nulls":18},{"$f":"IF(B12=\"\",\"\",表紙!$B$1)","v":""}]
["",{"$nulls":5},{"$f":"IF(F13=\"\",\"\",VLOOKUP(F13,学校データ!C:G,4,FALSE))","v":""},{"$nulls":7},{"v":0,"d":"0.00"},null,"",null,{"$f":"IF(E13=\"\",\"\",VLOOKUP(E13,競技データ!$F$2:$G$3,2,FALSE))","v":""},"","",null,"","",{"$f":"IF(H13=\"\",\"\",VLOOKUP(H13,競技データ!$A$2:$C$10,2,FALSE))","v":""},null,"",{"$f":"IF(AA13=\"\",\"\",VLOOKUP(AA13,学校データ!F:G,2,FALSE))","v":""},{"$nulls":4},"",{"$f":"IF(H13=\"\",\"\",VLOOKUP(H13,競技データ!$A$2:$C$10,3,FALSE))","v":""},"",{"$nulls":18},{"$f":"IF(B13=\"\",\"\",表紙!$B$1)","v":""}]
["",{"$nulls":5},{"$f":"IF(F14=\"\",\"\",VLOOKUP(F14,学校データ!C:G,4,FALSE))","v":""},{"$nulls":7},{"v":0,"d":"0.00"},null,"",null,{"$f":"IF(E14=\"\",\"\",VLOOKUP(E14,競技データ!$F$2:$G$3,2,FALSE))","v":""},"","",null,"","",{"$f":"IF(H14=\"\",\"\",VLOOKUP(H14,競技データ!$A$2:$C$10,2,FALSE))","v":""},null,"",{"$f":"IF(AA14=\"\",\"\",VLOOKUP(AA14,学校データ!F:G,2,FALSE))","v":""},{"$nulls":4},"",{"$f":"IF(H14=\"\",\"\",VLOOKUP(H14,競技データ!$A$2:$C$10,3,FALSE))","v":""},"",{"$nulls":18},{"$f":"IF(B14=\"\",\"\",表紙!$B$1)","v":""}]
["",{"$nulls":5},{"$f":"IF(F15=\"\",\"\",VLOOKUP(F15,学校データ!C:G,4,FALSE))","v":""},{"$nulls":7},{"v":0,"d":"0.00"},null,"",null,{"$f":"IF(E15=\"\",\"\",VLOOKUP(E15,競技データ!$F$2:$G$3,2,FALSE))","v":""},"","",null,"","",{"$f":"IF(H15=\"\",\"\",VLOOKUP(H15,競技データ!$A$2:$C$10,2,FALSE))","v":""},null,"",{"$f":"IF(AA15=\"\",\"\",VLOOKUP(AA15,学校データ!F:G,2,FALSE))","v":""},{"$nulls":4},"",{"$f":"IF(H15=\"\",\"\",VLOOKUP(H15,競技データ!$A$2:$C$10,3,FALSE))","v":""},"",{"$nulls":18},{"$f":"IF(B15=\"\",\"\",表紙!$B$1)","v":""}]
["",{"$nulls":5},{"$f":"IF(F16=\"\",\"\",VLOOKUP(F16,学校データ!C:G,4,FALSE))","v":""},{"$nulls":7},{"v":0,"d":"0.00"},null,"",null,{"$f":"IF(E16=\"\",\"\",VLOOKUP(E16,競技データ!$F$2:$G$3,2,FALSE))","v":""},"","",null,"","",{"$f":"IF(H16=\"\",\"\",VLOOKUP(H16,競技データ!$A$2:$C$10,2,FALSE))","v":""},null,"",{"$f":"IF(AA16=\"\",\"\",VLOOKUP(AA16,学校データ!F:G,2,FALSE))","v":""},{"$nulls":4},"",{"$f":"IF(H16=\"\",\"\",VLOOKUP(H16,競技データ!$A$2:$C$10,3,FALSE))","v":""},"",{"$nulls":18},{"$f":"IF(B16=\"\",\"\",表紙!$B$1)","v":""}]
["",{"$nulls":5},{"$f":"IF(F17=\"\",\"\",VLOOKUP(F17,学校データ!C:G,4,FALSE))","v":""},{"$nulls":7},{"v":0,"d":"0.00"},null,"",null,{"$f":"IF(E17=\"\",\"\",VLOOKUP(E17,競技データ!$F$2:$G$3,2,FALSE))","v":""},"","",null,"","",{"$f":"IF(H17=\"\",\"\",VLOOKUP(H17,競技データ!$A$2:$C$10,2,FALSE))","v":""},null,"",{"$f":"IF(AA17=\"\",\"\",VLOOKUP(AA17,学校データ!F:G,2,FALSE))","v":""},{"$nulls":4},"",{"$f":"IF(H17=\"\",\"\",VLOOKUP(H17,競技データ!$A$2:$C$10,3,FALSE))","v":""},"",{"$nulls":18},{"$f":"IF(B17=\"\",\"\",表紙!$B$1)","v":""}]
["",{"$nulls":5},{"$f":"IF(F18=\"\",\"\",VLOOKUP(F18,学校データ!C:G,4,FALSE))","v":""},{"$nulls":7},{"v":0,"d":"0.00"},null,"",null,{"$f":"IF(E18=\"\",\"\",VLOOKUP(E18,競技データ!$F$2:$G$3,2,FALSE))","v":""},"","",null,"","",{"$f":"IF(H18=\"\",\"\",VLOOKUP(H18,競技データ!$A$2:$C$10,2,FALSE))","v":""},null,"",{"$f":"IF(AA18=\"\",\"\",VLOOKUP(AA18,学校データ!F:G,2,FALSE))","v":""},{"$nulls":4},"",{"$f":"IF(H18=\"\",\"\",VLOOKUP(H18,競技データ!$A$2:$C$10,3,FALSE))","v":""},"",{"$nulls":18},{"$f":"IF(B18=\"\",\"\",表紙!$B$1)","v":""}]
["",{"$nulls":5},{"$f":"IF(F19=\"\",\"\",VLOOKUP(F19,学校データ!C:G,4,FALSE))","v":""},{"$nulls":7},{"v":0,"d":"0.00"},null,"",null,{"$f":"IF(E19=\"\",\"\",VLOOKUP(E19,競技データ!$F$2:$G$3,2,FALSE))","v":""},"","",null,"","",{"$f":"IF(H19=\"\",\"\",VLOOKUP(H19,競技データ!$A$2:$C$10,2,FALSE))","v":""},null,"",{"$f":"IF(AA19=\"\",\"\",VLOOKUP(AA19,学校データ!F:G,2,FALSE))","v":""},{"$nulls":4},"",{"$f":"IF(H19=\"\",\"\",VLOOKUP(H19,競技データ!$A$2:$C$10,3,FALSE))","v":""},"",{"$nulls":18},{"$f":"IF(B19=\"\",\"\",表紙!$B$1)","v":""}]
["",{"$nulls":5},{"$f":"IF(F20=\"\",\"\",VLOOKUP(F20,学校データ!C:G,4,FALSE))","v":""},{"$nulls":7},{"v":0,"d":"0.00"},null,"",null,{"$f":"IF(E20=\"\",\"\",VLOOKUP(E20,競技データ!$F$2:$G$3,2,FALSE))","v":""},"","",null,"","",{"$f":"IF(H20=\"\",\"\",VLOOKUP(H20,競技データ!$A$2:$C$10,2,FALSE))","v":""},null,"",{"$f":"IF(AA20=\"\",\"\",VLOOKUP(AA20,学校データ!F:G,2,FALSE))","v":""},{"$nulls":4},"",{"$f":"IF(H20=\"\",\"\",VLOOKUP(H20,競技データ!$A$2:$C$10,3,FALSE))","v":""},"",{"$nulls":18},{"$f":"IF(B20=\"\",\"\",表紙!$B$1)","v":""}]
{"$rows_left_out":183}
{"sheet":"リレー入力","index":2,"n_rows":85,"n_cols":29,"rows_kept":85,"merged":[[0,0,0,2]]}
[{"$f":"IF(表紙!B2=\"\",\"\",表紙!B2 & \"リレー入力\")","v":"前橋市リレー入力"},{"$nulls":4},"申込みタイム（各位ずつ記入）"]
["種目名","学校NO","学校名（自動表示）","分",null,"秒","1/10","1／100","1泳選手NO","1泳選手名（自動表示）","2泳選手NO","2泳選手名（自動表示）","3泳選手NO","3泳選手名（自動表示）","4泳選手NO","4泳選手名（自動表示）","補員選手NO","補員手名（自動表示）","タイム","チーム番号(4)","チーム名(20)","ﾖﾐｶﾞﾅ(15)","所属番号(4)","加盟番号(2)","学校(1)","ｸﾗｽ(2)","性別(1)","ｴﾝﾄﾘｰ(5)","ｴﾝﾄﾘｰﾀｲﾑ(7)"]
["男子200mフリーリレー",null,{"$f":"IF(B3=\"\",\"\",VLOOKUP(B3,学校データ!C:F,4,FALSE))","v":""},{"$nulls":6},{"$f":"IF(I3=\"\",\"\",VLOOKUP(I3,選手入力!$A:$B,2,FALSE))","v":""},null,{"$f":"IF(K3=\"\",\"\",VLOOKUP(K3,選手入力!$A:$B,2,FALSE))","v":""},null,{"$f":"IF(M3=\"\",\"\",VLOOKUP(M3,選手入力!$A:$B,2,FALSE))","v":""},null,{"$f":"IF(O3=\"\",\"\",VLOOKUP(O3,選手入力!$A:$B,2,FALSE))","v":""},null,{"$f":"IF(Q3=\"\",\"\",VLOOKUP(Q3,選手入力!$A:$B,2,FALSE))","v":""},{"$f":"D3*100+E3*10+F3+G3*0.1+H3*0.01","v":{"v":0,"d":"0.00"}},{"$f":"IF(B3=\"\",\"\",表紙!$B$21)","v":""},{"$f":"IF(C3=\"\",\"\",C3)","v":""},{"$f":"IF(U3=\"\",\"\",VLOOKUP(U3,学校データ!F:G,2,FALSE))","v":""},null,null,{"$f":"IF(B3=\"\",\"\",1)","v":""},{"$f":"IF(B3=\"\",\"\",1)","v":""},{"$f":"IF(B3=\"\",\"\",1)","v":""},{"$f":"IF(B3=\"\",\"\",60200)","v":""},{"$f":"IF(B3=\"\",\"\",S3)","v":""}]
[null,null,{"$f":"IF(B4=\"\",\"\",VLOOKUP(B4,学校データ!C:F,4,FALSE))","v":""},{"$nulls":6},{"$f":"IF(I4=\"\",\"\",VLOOKUP(I4,選手入力!$A:$B,2,FALSE))","v":""},null,{"$f":"IF(K4=\"\",\"\",VLOOKUP(K4,選手入力!$A:$B,2,FALSE))","v":""},null,{"$f":"IF(M4=\"\",\"\",VLOOKUP(M4,選手入力!$A:$B,2,FALSE))","v":""},null,{"$f":"IF(O4=\"\",\"\",VLOOKUP(O4,選手入力!$A:$B,2,FALSE))","v":""},null,{"$f":"IF(Q4=\"\",\"\",VLOOKUP(Q4,選手入力!$A:$B,2,FALSE))","v":""},{"$f":"D4*100+E4*10+F4+G4*0.1+H4*0.01","v":{"v":0,"d":"0.00"}},{"$f":"IF(B4=\"\",\"\",T3+1)","v":""},{"$f":"IF(C4=\"\",\"\",C4)","v":""},{"$f":"IF(U4=\"\",\"\",VLOOKUP(U4,学校データ!F:G,2,FALSE))","v":""},null,null,{"$f":"IF(B4=\"\",\"\",1)","v":""},{"$f":"IF(B4=\"\",\"\",1)","v":""},{"$f":"IF(B4=\"\",\"\",1)","v":""},{"$f":"IF(B4=\"\",\"\",60200)","v":""},{"$f":"IF(B4=\"\",\"\",S4)","v":""}]
[null,null,{"$f":"IF(B5=\"\",\"\",VLOOKUP(B5,学校データ!C:F,4,FALSE))","v":""},{"$nulls":6},{"$f":"IF(I5=\"\",\"\",VLOOKUP(I5,選手入力!$A:$B,2,FALSE))","v":""},null,{"$f":"IF(K5=\"\",\"\",VLOOKUP(K5,選手入力!$A:$B,2,FALSE))","v":""},null,{"$f":"IF(M5=\"\",\"\",VLOOKUP(M5,選手入力!$A:$B,2,FALSE))","v":""},null,{"$f":"IF(O5=\"\",\"\",VLOOKUP(O5,選手入力!$A:$B,2,FALSE))","v":""},null,{"$f":"IF(Q5=\"\",\"\",VLOOKUP(Q5,選手入力!$A:$B,2,FALSE))","v":""},{"v":0,"d":"0.00"},{"$f":"IF(B5=\"\",\"\",T4+1)","v":""},"",{"$f":"IF(U5=\"\",\"\",VLOOKUP(U5,学校データ!F:G,2,FALSE))","v":""},null,null,"","","","",""]
[null,null,{"$f":"IF(B6=\"\",\"\",VLOOKUP(B6,学校データ!C:F,4,FALSE))","v":""},{"$nulls":6},{"$f":"IF(I6=\"\",\"\",VLOOKUP(I6,選手入力!$A:$B,2,FALSE))","v":""},null,{"$f":"IF(K6=\"\",\"\",VLOOKUP(K6,選手入力!$A:$B,2,FALSE))","v":""},null,{"$f":"IF(M6=\"\",\"\",VLOOKUP(M6,選手入力!$A:$B,2,FALSE))","v":""},null,{"$f":"IF(O6=\"\",\"\",VLOOKUP(O6,選手入力!$A:$B,2,FALSE))","v":""},null,{"$f":"IF(Q6=\"\",\"\",VLOOKUP(Q6,選手入力!$A:$B,2,FALSE))","v":""},{"v":0,"d":"0.00"},"","",{"$f":"IF(U6=\"\",\"\",VLOOKUP(U6,学校データ!F:G,2,FALSE))","v":""},null,null,"","","","",""]
[null,null,{"$f":"IF(B7=\"\",\"\",VLOOKUP(B7,学校データ!C:F,4,FALSE))","v":""},{"$nulls":6},{"$f":"IF(I7=\"\",\"\",VLOOKUP(I7,選手入力!$A:$B,2,FALSE))","v":""},null,{"$f":"IF(K7=\"\",\"\",VLOOKUP(K7,選手入力!$A:$B,2,FALSE))","v":""},null,{"$f":"IF(M7=\"\",\"\",VLOOKUP(M7,選手入力!$A:$B,2,FALSE))","v":""},null,{"$f":"IF(O7=\"\",\"\",VLOOKUP(O7,選手入力!$A:$B,2,FALSE))","v":""},null,{"$f":"IF(Q7=\"\",\"\",VLOOKUP(Q7,選手入力!$A:$B,2,FALSE))","v":""},{"v":0,"d":"0.00"},"","",{"$f":"IF(U7=\"\",\"\",VLOOKUP(U7,学校データ!F:G,2,FALSE))","v":""},null,null,"","","","",""]
[null,null,{"$f":"IF(B8=\"\",\"\",VLOOKUP(B8,学校データ!C:F,4,FALSE))","v":""},{"$nulls":6},{"$f":"IF(I8=\"\",\"\",VLOOKUP(I8,選手入力!$A:$B,2,FALSE))","v":""},null,{"$f":"IF(K8=\"\",\"\",VLOOKUP(K8,選手入力!$A:$B,2,FALSE))","v":""},null,{"$f":"IF(M8=\"\",\"\",VLOOKUP(M8,選手入力!$A:$B,2,FALSE))","v":""},null,{"$f":"IF(O8=\"\",\"\",VLOOKUP(O8,選手入力!$A:$B,2,FALSE))","v":""},null,{"$f":"IF(Q8=\"\",\"\",VLOOKUP(Q8,選手入力!$A:$B,2,FALSE))","v":""},{"v":0,"d":"0.00"},"","",{"$f":"IF(U8=\"\",\"\",VLOOKUP(U8,学校データ!F:G,2,FALSE))","v":""},null,null,"","","","",""]
[null,null,{"$f":"IF(B9=\"\",\"\",VLOOKUP(B9,学校データ!C:F,4,FALSE))","v":""},{"$nulls":6},{"$f":"IF(I9=\"\",\"\",VLOOKUP(I9,選手入力!$A:$B,2,FALSE))","v":""},null,{"$f":"IF(K9=\"\",\"\",VLOOKUP(K9,選手入力!$A:$B,2,FALSE))","v":""},null,{"$f":"IF(M9=\"\",\"\",VLOOKUP(M9,選手入力!$A:$B,2,FALSE))","v":""},null,{"$f":"IF(O9=\"\",\"\",VLOOKUP(O9,選手入力!$A:$B,2,FALSE))","v":""},null,{"$f":"IF(Q9=\"\",\"\",VLOOKUP(Q9,選手入力!$A:$B,2,FALSE))","v":""},{"v":0,"d":"0.00"},"","",{"$f":"IF(U9=\"\",\"\",VLOOKUP(U9,学校データ!F:G,2,FALSE))","v":""},null,null,"","","","",""]
[null,null,{"$f":"IF(B10=\"\",\"\",VLOOKUP(B10,学校データ!C:F,4,FALSE))","v":""},{"$nulls":6},{"$f":"IF(I10=\"\",\"\",VLOOKUP(I10,選手入力!$A:$B,2,FALSE))","v":""},null,{"$f":"IF(K10=\"\",\"\",VLOOKUP(K10,選手入力!$A:$B,2,FALSE))","v":""},null,{"$f":"IF(M10=\"\",\"\",VLOOKUP(M10,選手入力!$A:$B,2,FALSE))","v":""},null,{"$f":"IF(O10=\"\",\"\",VLOOKUP(O10,選手入力!$A:$B,2,FALSE))","v":""},null,{"$f":"IF(Q10=\"\",\"\",VLOOKUP(Q10,選手入力!$A:$B,2,FALSE))","v":""},{"v":0,"d":"0.00"},"","",{"$f":"IF(U10=\"\",\"\",VLOOKUP(U10,学校データ!F:G,2,FALSE))","v":""},null,null,"","","","",""]
[null,null,{"$f":"IF(B11=\"\",\"\",VLOOKUP(B11,学校データ!C:F,4,FALSE))","v":""},{"$nulls":6},{"$f":"IF(I11=\"\",\"\",VLOOKUP(I11,選手入力!$A:$B,2,FALSE))","v":""},null,{"$f":"IF(K11=\"\",\"\",VLOOKUP(K11,選手入力!$A:$B,2,FALSE))","v":""},null,{"$f":"IF(M11=\"\",\"\",VLOOKUP(M11,選手入力!$A:$B,2,FALSE))","v":""},null,{"$f":"IF(O11=\"\",\"\",VLOOKUP(O11,選手入力!$A:$B,2,FALSE))","v":""},null,{"$f":"IF(Q11=\"\",\"\",VLOOKUP(Q11,選手入力!$A:$B,2,FALSE))","v":""},{"v":0,"d":"0.00"},"","",{"$f":"IF(U11=\"\",\"\",VLOOKUP(U11,学校データ!F:G,2,FALSE))","v":""},null,null,"","","","",""]
[null,null,{"$f":"IF(B12=\"\",\"\",VLOOKUP(B12,学校データ!C:F,4,FALSE))","v":""},{"$nulls":6},{"$f":"IF(I12=\"\",\"\",VLOOKUP(I12,選手入力!$A:$B,2,FALSE))","v":""},null,{"$f":"IF(K12=\"\",\"\",VLOOKUP(K12,選手入力!$A:$B,2,FALSE))","v":""},null,{"$f":"IF(M12=\"\",\"\",VLOOKUP(M12,選手入力!$A:$B,2,FALSE))","v":""},null,{"$f":"IF(O12=\"\",\"\",VLOOKUP(O12,選手入力!$A:$B,2,FALSE))","v":""},null,{"$f":"IF(Q12=\"\",\"\",VLOOKUP(Q12,選手入力!$A:$B,2,FALSE))","v":""},{"v":0,"d":"0.00"},"","",{"$f":"IF(U12=\"\",\"\",VLOOKUP(U12,学校データ!F:G,2,FALSE))","v":""},null,null,"","","","",""]
[null,null,{"$f":"IF(B13=\"\",\"\",VLOOKUP(B13,学校データ!C:F,4,FALSE))","v":""},{"$nulls":6},{"$f":"IF(I13=\"\",\"\",VLOOKUP(I13,選手入力!$A:$B,2,FALSE))","v":""},null,{"$f":"IF(K13=\"\",\"\",VLOOKUP(K13,選手入力!$A:$B,2,FALSE))","v":""},null,{"$f":"IF(M13=\"\",\"\",VLOOKUP(M13,選手入力!$A:$B,2,FALSE))","v":""},null,{"$f":"IF(O13=\"\",\"\",VLOOKUP(O13,選手入力!$A:$B,2,FALSE))","v":""},null,{"$f":"IF(Q13=\"\",\"\",VLOOKUP(Q13,選手入力!$A:$B,2,FALSE))","v":""},{"v":0,"d":"0.00"},"","",{"$f":"IF(U13=\"\",\"\",VLOOKUP(U13,学校データ!F:G,2,FALSE))","v":""},null,null,"","","","",""]
[null,null,{"$f":"IF(B14=\"\",\"\",VLOOKUP(B14,学校データ!C:F,4,FALSE))","v":""},{"$nulls":6},{"$f":"IF(I14=\"\",\"\",VLOOKUP(I14,選手入力!$A:$B,2,FALSE))","v":""},null,{"$f":"IF(K14=\"\",\"\",VLOOKUP(K14,選手入力!$A:$B,2,FALSE))","v":""},null,{"$f":"IF(M14=\"\",\"\",VLOOKUP(M14,選手入力!$A:$B,2,FALSE))","v":""},null,{"$f":"IF(O14=\"\",\"\",VLOOKUP(O14,選手入力!$A:$B,2,FALSE))","v":""},null,{"$f":"IF(Q14=\"\",\"\",VLOOKUP(Q14,選手入力!$A:$B,2,FALSE))","v":""},{"v":0,"d":"0.00"},"","",{"$f":"IF(U14=\"\",\"\",VLOOKUP(U14,学校データ!F:G,2,FALSE))","v":""},null,null,"","","","",""]
[null,null,{"$f":"IF(B15=\"\",\"\",VLOOKUP(B15,学校データ!C:F,4,FALSE))","v":""},{"$nulls":6},{"$f":"IF(I15=\"\",\"\",VLOOKUP(I15,選手入力!$A:$B,2,FALSE))","v":""},null,{"$f":"IF(K15=\"\",\"\",VLOOKUP(K15,選手入力!$A:$B,2,FALSE))","v":""},null,{"$f":"IF(M15=\"\",\"\",VLOOKUP(M15,選手入力!$A:$B,2,FALSE))","v":""},null,{"$f":"IF(O15=\"\",\"\",VLOOKUP(O15,選手入力!$A:$B,2,FALSE))","v":""},null,{"$f":"IF(Q15=\"\",\"\",VLOOKUP(Q15,選手入力!$A:$B,2,FALSE))","v":""},{"v":0,"d":"0.00"},"","",{"$f":"IF(U15=\"\",\"\",VLOOKUP(U15,学校データ!F:G,2,FALSE))","v":""},null,null,"","","","",""]
[null,null,{"$f":"IF(B16=\"\",\"\",VLOOKUP(B16,学校データ!C:F,4,FALSE))","v":""},{"$nulls":6},{"$f":"IF(I16=\"\",\"\",VLOOKUP(I16,選手入力!$A:$B,2,FALSE))","v":""},null,{"$f":"IF(K16=\"\",\"\",VLOOKUP(K16,選手入力!$A:$B,2,FALSE))","v":""},null,{"$f":"IF(M16=\"\",\"\",VLOOKUP(M16,選手入力!$A:$B,2,FALSE))","v":""},null,{"$f":"IF(O16=\"\",\"\",VLOOKUP(O16,選手入力!$A:$B,2,FALSE))","v":""},null,{"$f":"IF(Q16=\"\",\"\",VLOOKUP(Q16,選手入力!$A:$B,2,FALSE))","v":""},{"v":0,"d":"0.00"},"","",{"$f":"IF(U16=\"\",\"\",VLOOKUP(U16,学校データ!F:G,2,FALSE))","v":""},null,null,"","","","",""]
[null,null,{"$f":"IF(B17=\"\",\"\",VLOOKUP(B17,学校データ!C:F,4,FALSE))","v":""},{"$nulls":6},{"$f":"IF(I17=\"\",\"\",VLOOKUP(I17,選手入力!$A:$B,2,FALSE))","v":""},null,{"$f":"IF(K17=\"\",\"\",VLOOKUP(K17,選手入力!$A:$B,2,FALSE))","v":""},null,{"$f":"IF(M17=\"\",\"\",VLOOKUP(M17,選手入力!$A:$B,2,FALSE))","v":""},null,{"$f":"IF(O17=\"\",\"\",VLOOKUP(O17,選手入力!$A:$B,2,FALSE))","v":""},null,{"$f":"IF(Q17=\"\",\"\",VLOOKUP(Q17,選手入力!$A:$B,2,FALSE))","v":""},{"v":0,"d":"0.00"},"","",{"$f":"IF(U17=\"\",\"\",VLOOKUP(U17,学校データ!F:G,2,FALSE))","v":""},null,null,"","","","",""]
[null,null,{"$f":"IF(B18=\"\",\"\",VLOOKUP(B18,学校データ!C:F,4,FALSE))","v":""},{"$nulls":6},{"$f":"IF(I18=\"\",\"\",VLOOKUP(I18,選手入力!$A:$B,2,FALSE))","v":""},null,{"$f":"IF(K18=\"\",\"\",VLOOKUP(K18,選手入力!$A:$B,2,FALSE))","v":""},null,{"$f":"IF(M18=\"\",\"\",VLOOKUP(M18,選手入力!$A:$B,2,FALSE))","v":""},null,{"$f":"IF(O18=\"\",\"\",VLOOKUP(O18,選手入力!$A:$B,2,FALSE))","v":""},null,{"$f":"IF(Q18=\"\",\"\",VLOOKUP(Q18,選手入力!$A:$B,2,FALSE))","v":""},{"v":0,"d":"0.00"},"","",{"$f":"IF(U18=\"\",\"\",VLOOKUP(U18,学校データ!F:G,2,FALSE))","v":""},null,null,"","","","",""]
[null,null,{"$f":"IF(B19=\"\",\"\",VLOOKUP(B19,学校データ!C:F,4,FALSE))","v":""},{"$nulls":6},{"$f":"IF(I19=\"\",\"\",VLOOKUP(I19,選手入力!$A:$B,2,FALSE))","v":""},null,{"$f":"IF(K19=\"\",\"\",VLOOKUP(K19,選手入力!$A:$B,2,FALSE))","v":""},null,{"$f":"IF(M19=\"\",\"\",VLOOKUP(M19,選手入力!$A:$B,2,FALSE))","v":""},null,{"$f":"IF(O19=\"\",\"\",VLOOKUP(O19,選手入力!$A:$B,2,FALSE))","v":""},null,{"$f":"IF(Q19=\"\",\"\",VLOOKUP(Q19,選手入力!$A:$B,2,FALSE))","v":""},{"v":0,"d":"0.00"},"","",{"$f":"IF(U19=\"\",\"\",VLOOKUP(U19,学校データ!F:G,2,FALSE))","v":""},null,null,"","","","",""]
[null,null,{"$f":"IF(B20=\"\",\"\",VLOOKUP(B20,学校データ!C:F,4,FALSE))","v":""},{"$nulls":6},{"$f":"IF(I20=\"\",\"\",VLOOKUP(I20,選手入力!$A:$B,2,FALSE))","v":""},null,{"$f":"IF(K20=\"\",\"\",VLOOKUP(K20,選手入力!$A:$B,2,FALSE))","v":""},null,{"$f":"IF(M20=\"\",\"\",VLOOKUP(M20,選手入力!$A:$B,2,FALSE))","v":""},null,{"$f":"IF(O20=\"\",\"\",VLOOKUP(O20,選手入力!$A:$B,2,FALSE))","v":""},null,{"$f":"IF(Q20=\"\",\"\",VLOOKUP(Q20,選手入力!$A:$B,2,FALSE))","v":""},{"v":0,"d":"0.00"},"","",{"$f":"IF(U20=\"\",\"\",VLOOKUP(U20,学校データ!F:G,2,FALSE))","v":""},null,null,"","","","",""]
{"$rows_left_out":66}
{"sheet":"競技データ","index":3,"n_rows":10,"n_cols":7,"rows_kept":10}
["種目名","クラス","コード",null,"学年","性別"]
["50m自由形",1,10050,null,5,"男子",1]
["50m背泳ぎ",1,20050,null,6,"女子",2]
["50m平泳ぎ",1,30050]
["50mバタフライ",1,40050]
["リレーのみ",1]
["友好レース自由形",2,10050]
["友好レース背泳ぎ",2,20050]
["友好レース平泳ぎ",2,30050]
["友好レースバタフライ",2,40050]

{"sheet":"郡市データ","index":4,"n_rows":23,"n_cols":9,"rows_kept":23}
["郡市番号","郡市名","学校数","学校番号初期値","選手番号初期値","チーム番号初期値"]
[1,"前橋市",47,100101,1001,101,null,"前橋",{"$f":"PHONETIC(H2)","v":"ﾏｴﾊﾞｼ"}]
[2,"伊勢崎市",23,100201,2001,201,null,"伊勢崎",{"$f":"PHONETIC(H3)","v":"ｲｾｻｷ"}]
[3,"佐波郡",6,100301,3001,301,null,"佐波","ｻﾜ"]
[4,"北群馬郡",4,100401,4001,401,null,"北群馬","ｷﾀｸﾞﾝﾏ"]
[5,"渋川市",14,100501,5001,501,null,"渋川","ｼﾌﾞｶﾜ"]
[6,"利根郡",11,100601,6001,601,null,"利根","ﾄﾈ"]
[7,"沼田市",11,100701,7001,701,null,"沼田","ﾇﾏﾀ"]
[8,"吾妻郡",14,100801,8001,801,null,"吾妻","ｱｶﾞﾂﾏ"]
[9,"高崎市",58,100901,9001,901,null,"高崎","ﾀｶｻｷ"]
[10,"安中市",12,101001,10001,1001,null,"安中","ｱﾝﾅｶ"]
[11,"甘楽・富岡",16,101101,11001,1101,null,"甘・富","ｶﾝﾗﾄﾐｵｶ"]
[12,"藤岡・多野",13,101201,12001,1201,null,"藤・多","ﾌｼﾞｵｶﾀﾉ"]
[13,"桐生市",17,101301,13001,1301,null,"桐生","ｷﾘｭｳ"]
[14,"みどり市",7,101401,14001,1401,null,"みどり","ﾐﾄﾞﾘ"]
[15,"太田市",25,101501,15001,1501,null,"太田","ｵｵﾀ"]
[16,"邑楽郡",14,101601,16001,1601,null,"邑楽","ｵｳﾗ"]
[17,"館林市",11,101701,17001,1701,null,"館林","ﾀﾃﾊﾞﾔｼ"]
[]
[]
{"$rows_left_out":4}
{"sheet":"学校データ","index":5,"n_rows":336,"n_cols":9,"rows_kept":336}
["郡市名","№","学校コード\n申し込みには\nこのｺｰﾄﾞを\n入力","MCコード","学校名","略称","ﾖﾐｶﾞﾅ","リレーNO初期値","選手NO初期値"]
["０１",1,101,100101,"前橋市立桃井小学校","前・桃井","ﾏｴﾊﾞｼ.ﾓﾓﾉｲ",1,1]
["前橋市",2,102,100102,"前橋市立中川小学校","前・中川","ﾏｴﾊﾞｼ.ﾅｶｶﾞﾜ",6,51]
[null,3,103,100103,"前橋市立敷島小学校","前・敷島","ﾏｴﾊﾞｼ.ｼｷｼﾏ",11,101]
[null,4,104,100104,"前橋市立城南小学校","前・城南","ﾏｴﾊﾞｼ.ｼﾞｮｳﾅﾝ",16,151]
[null,5,105,100105,"前橋市立城東小学校","前・城東","ﾏｴﾊﾞｼ.ｼﾞｮｳﾄｳ",21,201]
[null,6,106,100106,"前橋市立若宮小学校","前・若宮","ﾏｴﾊﾞｼ.ﾜｶﾐﾔ",26,251]
[null,7,107,100107,"前橋市立天川小学校","前・天川","ﾏｴﾊﾞｼ.ｱﾏｶﾞﾜ",31,301]
[null,8,108,100108,"前橋市立岩神小学校","前・岩神","ﾏｴﾊﾞｼ.ｲﾜｶﾞﾐ",36,351]
[null,9,null,"","","","",41,401]
[null,10,110,100110,"前橋市立広瀬小学校","前・広瀬","ﾏｴﾊﾞｼ.ﾋﾛｾ",46,451]
[null,11,111,100111,"前橋市立山王小学校","前・山王","ﾏｴﾊﾞｼ.ｻﾝﾉｳ",51,501]
[null,12,112,100112,"前橋市立わかば小学校","前・わかば","ﾏｴﾊﾞｼ.ﾜｶﾊﾞ",56,551]
[null,13,null,"","","","",61,601]
[null,14,114,100114,"前橋市立上川淵小学校","前・上川淵","ﾏｴﾊﾞｼ.ｶﾐｶﾜﾌﾁ",66,651]
[null,15,115,100115,"前橋市立下川淵小学校","前・下川淵","ﾏｴﾊﾞｼ.ｼﾓｶﾜﾌﾁ",71,701]
[null,16,116,100116,"前橋市立桂萱小学校","前・桂萱","ﾏｴﾊﾞｼ.ｶｲｶﾞﾔ",76,751]
[null,17,117,100117,"前橋市立桃木小学校","前・桃木","ﾏｴﾊﾞｼ.ﾓﾓﾉｷ",81,801]
[null,18,118,100118,"前橋市立桂萱東小学校","前・桂萱東","ﾏｴﾊﾞｼ.ｶｲｶﾞﾔﾋｶﾞｼ",86,851]
[null,19,119,100119,"前橋市立桃瀬小学校","前・桃瀬","ﾏｴﾊﾞｼ.ﾓﾓﾉｾ",91,901]
{"$rows_left_out":316}