{"text_format":"3","workbook":"xlsx","n_sheets":6,"sheets":["表紙","選手入力","リレー入力","学校データ","郡市データ","競技データ"],"not_rendered":{"macros":1},"read":"whole","date_system":"1900"}

{"sheet":"表紙","index":0,"n_rows":34,"n_cols":5,"rows_kept":34,"merged":[[0,0,0,1]]}
["令和5年度　○○市○○郡小学校陸上教室記録会エントリー"]
["学校NO"]
["学校名（自動表示）",{"$f":"VLOOKUP($B$2,学校データ!$A$1:$H$312,3,FALSE)","v":{"$error":"#N/A"}}]
["郡市NO"]
["郡市名（自動表示）",{"$f":"VLOOKUP(B4,郡市データ!$A$1:$B$19,2,FALSE)","v":"な　し"}]
["学校電話番号","027-123-1234",null,"男子",5]
["担当者名","群馬　太郎",null,"女子",6]
["担当者メールアドレス","gepra-joho@gepra7.ec-net.jp"]
["担当者電話番号","027-123-4567"]
[null,"エントリー人数"]
["１００ｍ男子小学５年",{"$f":"COUNTIF(選手入力!$AM$3:$AM$202,表紙!D11)","v":0},null,"002   105"]
["１００ｍ男子小学６年",{"$f":"COUNTIF(選手入力!$AM$3:$AM$202,表紙!D12)","v":0},null,"002   106"]
["１０００ｍ男子小学５・６年",{"$f":"COUNTIF(選手入力!$AM$3:$AM$202,表紙!D13)","v":0},null,"007   100"]
["５０ｍＨ男子小学５・６年",{"$f":"COUNTIF(選手入力!$AM$3:$AM$202,表紙!D14)","v":0},null,"042   100"]
["１００ｍ男子小学友好レース",{"$f":"COUNTIF(選手入力!$AM$3:$AM$202,表紙!D15)","v":0},null,"002   107"]
{"$rows_left_out":20}
{"sheet":"選手入力","index":1,"n_rows":202,"n_cols":39,"rows_kept":202,"merged":[[0,0,0,4],[0,8,0,12]]}
[{"$f":"CONCATENATE(表紙!B3,\"チーム選手入力\")","v":{"$error":"#N/A"}},{"$nulls":6},"友好・リレーのみもこちらに","申込みタイム（各位ずつ記入）"]
["選手NO","漢字氏名","ﾖﾐｶﾞﾅ","学年","性別","学校NO（自動表示）","学校名（自動表示）","種目1","分",null,"秒・ｍ","1/10","1/100・ｃｍ",{"$nulls":10},"DB","N1","N2","SX","KC","MC","TL","WT","ZK","S1","S2","S3","S4"]
[1,{"$nulls":4},{"$f":"IF(B3=\"\",\"\",表紙!$B$2)","v":""},{"$f":"IF(B3=\"\",\"\",VLOOKUP(F3,学校データ!A:D,4,FALSE))","v":""},{"$nulls":7},{"$f":"IF(I3=\"\",0,I3)","v":0},{"$f":"IF(J3=\"\",0,J3)","v":0},{"$f":"IF(K3=\"\",0,K3)","v":0},{"$f":"IF(L3=\"\",0,L3)","v":0},{"$f":"IF(M3=\"\",0,M3)","v":0},{"$f":"CONCATENATE(\"00\",O3,P3,Q3,R3,S3)","v":"0000000"},{"$f":"IF(B3=\"\",\"\",VLOOKUP(H3,競技データ!$B$21:$C$29,2,FALSE))","v":""},{"$f":"IF(B3=\"\",\"\",IF(H3=\"100ｍ\",CONCATENATE(\"0\",D3),IF(H3=\"友好100ｍ\",\"07\",\"00\")))","v":""},null,{"$f":"IF(B3=\"\",\"\",表紙!$B$33+選手入力!A3)","v":""},{"$f":"IF(B3=\"\",\"\",B3 & \"(\" &D3&\")\")","v":""},{"$f":"IF(B3=\"\",\"\",C3)","v":""},{"$f":"IF(E3=\"\",\"\",IF(E3=\"男子\",1,2))","v":""},{"$f":"IF(B3=\"\",\"\",表紙!$B$4)","v":""},{"$f":"IF(B3=\"\",\"\",F3)","v":""},null,null,{"$f":"IF(B3=\"\",\"\",X3)","v":""},{"$f":"IF(B3=\"\",\"\",IF(H3=\"リレーのみ\",\"R99900\",CONCATENATE(U3,V3,\" \",T3)))","v":""},{"$nulls":3},{"$f":"IF(AG3=\"\",\"\",RIGHT(LEFT(AG3,4),3))","v":""},{"$f":"IF(AG3=\"\",\"\",RIGHT(LEFT(AG3,6),2))","v":""},{"$f":"IF(AG3=\"\",\"\",CONCATENATE(AK3,\"   \",AA3,AL3))","v":""}]
[2,{"$nulls":4},{"$f":"IF(B4=\"\",\"\",表紙!$B$2)","v":""},{"$f":"IF(B4=\"\",\"\",VLOOKUP(F4,学校データ!A:D,4,FALSE))","v":""},{"$nulls":7},{"$f":"IF(I4=\"\",0,I4)","v":0},0,0,0,0,{"$f":"CONCATENATE(\"00\",O4,P4,Q4,R4,S4)","v":"0000000"},{"$f":"IF(B4=\"\",\"\",VLOOKUP(H4,競技データ!$B$21:$C$29,2,FALSE))","v":""},{"$f":"IF(B4=\"\",\"\",IF(H4=\"100ｍ\",CONCATENATE(\"0\",D4),IF(H4=\"友好100ｍ\",\"07\",\"00\")))","v":""},null,{"$f":"IF(B4=\"\",\"\",表紙!$B$33+選手入力!A4)","v":""},{"$f":"IF(B4=\"\",\"\",B4 & \"(\" &D4&\")\")","v":""},"","",{"$f":"IF(B4=\"\",\"\",表紙!$B$4)","v":""},"",null,null,"",{"$f":"IF(B4=\"\",\"\",IF(H4=\"リレーのみ\",\"R99900\",CONCATENATE(U4,V4,\" \",T4)))","v":""},{"$nulls":3},{"$f":"IF(AG4=\"\",\"\",RIGHT(LEFT(AG4,4),3))","v":""},{"$f":"IF(AG4=\"\",\"\",RIGHT(LEFT(AG4,6),2))","v":""},{"$f":"IF(AG4=\"\",\"\",CONCATENATE(AK4,\"   \",AA4,AL4))","v":""}]
[3,{"$nulls":4},{"$f":"IF(B5=\"\",\"\",表紙!$B$2)","v":""},{"$f":"IF(B5=\"\",\"\",VLOOKUP(F5,学校データ!A:D,4,FALSE))","v":""},{"$nulls":7},0,0,0,0,0,"0000000",{"$f":"IF(B5=\"\",\"\",VLOOKUP(H5,競技データ!$B$21:$C$29,2,FALSE))","v":""},"",null,{"$f":"IF(B5=\"\",\"\",表紙!$B$33+選手入力!A5)","v":""},"","","",{"$f":"IF(B5=\"\",\"\",表紙!$B$4)","v":""},"",null,null,"","",{"$nulls":3},"","",""]
[4,{"$nulls":4},{"$f":"IF(B6=\"\",\"\",表紙!$B$2)","v":""},{"$f":"IF(B6=\"\",\"\",VLOOKUP(F6,学校データ!A:D,4,FALSE))","v":""},{"$nulls":7},0,0,0,0,0,"0000000",{"$f":"IF(B6=\"\",\"\",VLOOKUP(H6,競技データ!$B$21:$C$29,2,FALSE))","v":""},"",null,{"$f":"IF(B6=\"\",\"\",表紙!$B$33+選手入力!A6)","v":""},"","","",{"$f":"IF(B6=\"\",\"\",表紙!$B$4)","v":""},"",null,null,"","",{"$nulls":3},"","",""]
[5,{"$nulls":4},{"$f":"IF(B7=\"\",\"\",表紙!$B$2)","v":""},{"$f":"IF(B7=\"\",\"\",VLOOKUP(F7,学校データ!A:D,4,FALSE))","v":""},{"$nulls":7},0,0,0,0,0,"0000000",{"$f":"IF(B7=\"\",\"\",VLOOKUP(H7,競技データ!$B$21:$C$29,2,FALSE))","v":""},"",null,{"$f":"IF(B7=\"\",\"\",表紙!$B$33+選手入力!A7)","v":""},"","","",{"$f":"IF(B7=\"\",\"\",表紙!$B$4)","v":""},"",null,null,"","",{"$nulls":3},"","",""]
[6,{"$nulls":4},{"$f":"IF(B8=\"\",\"\",表紙!$B$2)","v":""},{"$f":"IF(B8=\"\",\"\",VLOOKUP(F8,学校データ!A:D,4,FALSE))","v":""},{"$nulls":7},0,0,0,0,0,"0000000",{"$f":"IF(B8=\"\",\"\",VLOOKUP(H8,競技データ!$B$21:$C$29,2,FALSE))","v":""},"",null,{"$f":"IF(B8=\"\",\"\",表紙!$B$33+選手入力!A8)","v":""},"","","",{"$f":"IF(B8=\"\",\"\",表紙!$B$4)","v":""},"",null,null,"","",{"$nulls":3},"","",""]
[7,{"$nulls":4},{"$f":"IF(B9=\"\",\"\",表紙!$B$2)","v":""},{"$f":"IF(B9=\"\",\"\",VLOOKUP(F9,学校データ!A:D,4,FALSE))","v":""},{"$nulls":7},0,0,0,0,0,"0000000",{"$f":"IF(B9=\"\",\"\",VLOOKUP(H9,競技データ!$B$21:$C$29,2,FALSE))","v":""},"",null,{"$f":"IF(B9=\"\",\"\",表紙!$B$33+選手入力!A9)","v":""},"","","",{"$f":"IF(B9=\"\",\"\",表紙!$B$4)","v":""},"",null,null,"","",{"$nulls":3},"","",""]
[8,{"$nulls":4},{"$f":"IF(B10=\"\",\"\",表紙!$B$2)","v":""},{"$f":"IF(B10=\"\",\"\",VLOOKUP(F10,学校データ!A:D,4,FALSE))","v":""},{"$nulls":7},0,0,0,0,0,"0000000",{"$f":"IF(B10=\"\",\"\",VLOOKUP(H10,競技データ!$B$21:$C$29,2,FALSE))","v":""},"",null,{"$f":"IF(B10=\"\",\"\",表紙!$B$33+選手入力!A10)","v":""},"","","",{"$f":"IF(B10=\"\",\"\",表紙!$B$4)","v":""},"",null,null,"","",{"$nulls":3},"","",""]
[9,{"$nulls":4},{"$f":"IF(B11=\"\",\"\",表紙!$B$2)","v":""},{"$f":"IF(B11=\"\",\"\",VLOOKUP(F11,学校データ!A:D,4,FALSE))","v":""},{"$nulls":7},0,0,0,0,0,"0000000",{"$f":"IF(B11=\"\",\"\",VLOOKUP(H11,競技データ!$B$21:$C$29,2,FALSE))","v":""},"",null,{"$f":"IF(B11=\"\",\"\",表紙!$B$33+選手入力!A11)","v":""},"","","",{"$f":"IF(B11=\"\",\"\",表紙!$B$4)","v":""},"",null,null,"","",{"$nulls":3},"","",""]
[10,{"$nulls":4},{"$f":"IF(B12=\"\",\"\",表紙!$B$2)","v":""},{"$f":"IF(B12=\"\",\"\",VLOOKUP(F12,学校データ!A:D,4,FALSE))","v":""},{"$nulls":7},0,0,0,0,0,"0000000",{"$f":"IF(B12=\"\",\"\",VLOOKUP(H12,競技データ!$B$21:$C$29,2,FALSE))","v":""},"",null,{"$f":"IF(B12=\"\",\"\",表紙!$B$33+選手入力!A12)","v":""},"","","",{"$f":"IF(B12=\"\",\"\",表紙!$B$4)","v":""},"",null,null,"","",{"$nulls":3},"","",""]
[11,{"$nulls":4},{"$f":"IF(B13=\"\",\"\",表紙!$B$2)","v":""},{"$f":"IF(B13=\"\",\"\",VLOOKUP(F13,学校データ!A:D,4,FALSE))","v":""},{"$nulls":7},0,0,0,0,0,"0000000",{"$f":"IF(B13=\"\",\"\",VLOOKUP(H13,競技データ!$B$21:$C$29,2,FALSE))","v":""},"",null,{"$f":"IF(B13=\"\",\"\",表紙!$B$33+選手入力!A13)","v":""},"","","",{"$f":"IF(B13=\"\",\"\",表紙!$B$4)","v":""},"",null,null,"","",{"$nulls":3},"","",""]
[12,{"$nulls":4},{"$f":"IF(B14=\"\",\"\",表紙!$B$2)","v":""},{"$f":"IF(B14=\"\",\"\",VLOOKUP(F14,学校データ!A:D,4,FALSE))","v":""},{"$nulls":7},0,0,0,0,0,"0000000",{"$f":"IF(B14=\"\",\"\",VLOOKUP(H14,競技データ!$B$21:$C$29,2,FALSE))","v":""},"",null,{"$f":"IF(B14=\"\",\"\",表紙!$B$33+選手入力!A14)","v":""},"","","",{"$f":"IF(B14=\"\",\"\",表紙!$B$4)","v":""},"",null,null,"","",{"$nulls":3},"","",""]
[13,{"$nulls":4},{"$f":"IF(B15=\"\",\"\",表紙!$B$2)","v":""},{"$f":"IF(B15=\"\",\"\",VLOOKUP(F15,学校データ!A:D,4,FALSE))","v":""},{"$nulls":7},0,0,0,0,0,"0000000",{"$f":"IF(B15=\"\",\"\",VLOOKUP(H15,競技データ!$B$21:$C$29,2,FALSE))","v":""},"",null,{"$f":"IF(B15=\"\",\"\",表紙!$B$33+選手入力!A15)","v":""},"","","",{"$f":"IF(B15=\"\",\"\",表紙!$B$4)","v":""},"",null,null,"","",{"$nulls":3},"","",""]
{"$rows_left_out":188}
{"sheet":"リレー入力","index":2,"n_rows":82,"n_cols":42,"rows_kept":82,"merged":[[0,0,0,2]]}
[{"$f":"CONCATENATE(表紙!B3,\"リレー入力\")","v":{"$error":"#N/A"}},{"$nulls":4},"申込みタイム（各位ずつ記入）"]
["種目名","学校NO（自動表示）","学校名（自動表示）","分",null,"秒","1/10","1／100","1走選手NO","1走選手名（自動表示）","2走選手NO","2走選手名（自動表示）","3走選手NO","3走選手名（自動表示）","4走選手NO","4走選手名（自動表示）","補員選手NO","補員名（自動表示）",{"$nulls":8},"DB","ZK","KC","N1","N2","TM","KM","LN","S1","S2","S3","S4","S5","S6","S7","S8"]
["男子4×100mリレー",{"$f":"IF(I3=\"\",\"\",表紙!$B$2)","v":""},{"$f":"IF(B3=\"\",\"\",VLOOKUP(リレー入力!B3,学校データ!$A:$E,4,FALSE))","v":""},{"$nulls":6},{"$f":"IF(I3=\"\",\"\",VLOOKUP(I3,選手入力!$A$2:$B$202,2,FALSE))","v":""},null,{"$f":"IF(K3=\"\",\"\",VLOOKUP(K3,選手入力!$A$2:$B$202,2,FALSE))","v":""},null,{"$f":"IF(M3=\"\",\"\",VLOOKUP(M3,選手入力!$A$2:$B$202,2,FALSE))","v":""},null,{"$f":"IF(O3=\"\",\"\",VLOOKUP(O3,選手入力!$A$2:$B$202,2,FALSE))","v":""},null,{"$f":"IF(Q3=\"\",\"\",VLOOKUP(Q3,選手入力!$A$2:$B$202,2,FALSE))","v":""},1,{"$f":"IF(D3=\"\",0,D3)","v":0},{"$f":"IF(E3=\"\",0,E3)","v":0},{"$f":"IF(F3=\"\",0,F3)","v":0},{"$f":"IF(G3=\"\",0,G3)","v":0},{"$f":"IF(H3=\"\",0,H3)","v":0},{"$f":"CONCATENATE(\"00\",T3,U3,V3,W3,X3)","v":"0000000"},null,{"$f":"IF($B3=\"\",\"\",表紙!$B$34+リレー入力!$S3)","v":""},{"$f":"IF($B3=\"\",\"\",AA3)","v":""},{"$f":"IF($B3=\"\",\"\",表紙!$B$4)","v":""},{"$f":"IF($B3=\"\",\"\",C3)","v":""},null,{"$f":"IF($B3=\"\",\"\",Y3)","v":""},null,null,{"$f":"IF(I3=\"\",\"\",VLOOKUP(J3,選手入力!$B$2:$X$202,23,FALSE))","v":""},{"$f":"IF(K3=\"\",\"\",VLOOKUP(L3,選手入力!$B$2:$X$202,23,FALSE))","v":""},{"$f":"IF(M3=\"\",\"\",VLOOKUP(N3,選手入力!$B$2:$X$202,23,FALSE))","v":""},{"$f":"IF(O3=\"\",\"\",VLOOKUP(P3,選手入力!$B$2:$X$202,23,FALSE))","v":""},{"$f":"IF(Q3=\"\",\"\",VLOOKUP(R3,選手入力!$B$2:$X$202,23,FALSE))","v":""}]
[{"$nulls":9},{"$f":"IF(I4=\"\",\"\",VLOOKUP(I4,選手入力!$A$2:$B$202,2,FALSE))","v":""},null,{"$f":"IF(K4=\"\",\"\",VLOOKUP(K4,選手入力!$A$2:$B$202,2,FALSE))","v":""},null,{"$f":"IF(M4=\"\",\"\",VLOOKUP(M4,選手入力!$A$2:$B$202,2,FALSE))","v":""},null,{"$f":"IF(O4=\"\",\"\",VLOOKUP(O4,選手入力!$A$2:$B$202,2,FALSE))","v":""},null,{"$f":"IF(Q4=\"\",\"\",VLOOKUP(Q4,選手入力!$A$2:$B$202,2,FALSE))","v":""},2,{"$f":"IF(D4=\"\",0,D4)","v":0},0,0,0,0,{"$f":"CONCATENATE(\"00\",T4,U4,V4,W4,X4)","v":"0000000"},null,{"$f":"IF($B4=\"\",\"\",表紙!$B$34+リレー入力!$S4)","v":""},{"$f":"IF($B4=\"\",\"\",AA4)","v":""},{"$f":"IF($B4=\"\",\"\",表紙!$B$4)","v":""},{"$f":"IF($B4=\"\",\"\",C4)","v":""},null,{"$f":"IF($B4=\"\",\"\",Y4)","v":""},null,null,{"$f":"IF(I4=\"\",\"\",VLOOKUP(J4,選手入力!$B$2:$X$202,23,FALSE))","v":""},{"$f":"IF(K4=\"\",\"\",VLOOKUP(L4,選手入力!$B$2:$X$202,23,FALSE))","v":""},{"$f":"IF(M4=\"\",\"\",VLOOKUP(N4,選手入力!$B$2:$X$202,23,FALSE))","v":""},{"$f":"IF(O4=\"\",\"\",VLOOKUP(P4,選手入力!$B$2:$X$202,23,FALSE))","v":""},{"$f":"IF(Q4=\"\",\"\",VLOOKUP(R4,選手入力!$B$2:$X$202,23,FALSE))","v":""}]
[{"$nulls":9},{"$f":"IF(I5=\"\",\"\",VLOOKUP(I5,選手入力!$A$2:$B$202,2,FALSE))","v":""},null,{"$f":"IF(K5=\"\",\"\",VLOOKUP(K5,選手入力!$A$2:$B$202,2,FALSE))","v":""},null,{"$f":"IF(M5=\"\",\"\",VLOOKUP(M5,選手入力!$A$2:$B$202,2,FALSE))","v":""},null,{"$f":"IF(O5=\"\",\"\",VLOOKUP(O5,選手入力!$A$2:$B$202,2,FALSE))","v":""},null,{"$f":"IF(Q5=\"\",\"\",VLOOKUP(Q5,選手入力!$A$2:$B$202,2,FALSE))","v":""},3,0,0,0,0,0,"0000000",null,{"$f":"IF($B5=\"\",\"\",表紙!$B$34+リレー入力!$S5)","v":""},"",{"$f":"IF($B5=\"\",\"\",表紙!$B$4)","v":""},"",null,"",null,null,{"$f":"IF(I5=\"\",\"\",VLOOKUP(J5,選手入力!$B$2:$X$202,23,FALSE))","v":""},{"$f":"IF(K5=\"\",\"\",VLOOKUP(L5,選手入力!$B$2:$X$202,23,FALSE))","v":""},{"$f":"IF(M5=\"\",\"\",VLOOKUP(N5,選手入力!$B$2:$X$202,23,FALSE))","v":""},{"$f":"IF(O5=\"\",\"\",VLOOKUP(P5,選手入力!$B$2:$X$202,23,FALSE))","v":""},{"$f":"IF(Q5=\"\",\"\",VLOOKUP(R5,選手入力!$B$2:$X$202,23,FALSE))","v":""}]
[{"$nulls":9},{"$f":"IF(I6=\"\",\"\",VLOOKUP(I6,選手入力!$A$2:$B$202,2,FALSE))","v":""},null,{"$f":"IF(K6=\"\",\"\",VLOOKUP(K6,選手入力!$A$2:$B$202,2,FALSE))","v":""},null,{"$f":"IF(M6=\"\",\"\",VLOOKUP(M6,選手入力!$A$2:$B$202,2,FALSE))","v":""},null,{"$f":"IF(O6=\"\",\"\",VLOOKUP(O6,選手入力!$A$2:$B$202,2,FALSE))","v":""},null,{"$f":"IF(Q6=\"\",\"\",VLOOKUP(Q6,選手入力!$A$2:$B$202,2,FALSE))","v":""},4,0,0,0,0,0,"0000000",null,{"$f":"IF($B6=\"\",\"\",表紙!$B$34+リレー入力!$S6)","v":""},"",{"$f":"IF($B6=\"\",\"\",表紙!$B$4)","v":""},"",null,"",null,null,{"$f":"IF(I6=\"\",\"\",VLOOKUP(J6,選手入力!$B$2:$X$202,23,FALSE))","v":""},{"$f":"IF(K6=\"\",\"\",VLOOKUP(L6,選手入力!$B$2:$X$202,23,FALSE))","v":""},{"$f":"IF(M6=\"\",\"\",VLOOKUP(N6,選手入力!$B$2:$X$202,23,FALSE))","v":""},{"$f":"IF(O6=\"\",\"\",VLOOKUP(P6,選手入力!$B$2:$X$202,23,FALSE))","v":""},{"$f":"IF(Q6=\"\",\"\",VLOOKUP(R6,選手入力!$B$2:$X$202,23,FALSE))","v":""}]
[{"$nulls":9},{"$f":"IF(I7=\"\",\"\",VLOOKUP(I7,選手入力!$A$2:$B$202,2,FALSE))","v":""},null,{"$f":"IF(K7=\"\",\"\",VLOOKUP(K7,選手入力!$A$2:$B$202,2,FALSE))","v":""},null,{"$f":"IF(M7=\"\",\"\",VLOOKUP(M7,選手入力!$A$2:$B$202,2,FALSE))","v":""},null,{"$f":"IF(O7=\"\",\"\",VLOOKUP(O7,選手入力!$A$2:$B$202,2,FALSE))","v":""},null,{"$f":"IF(Q7=\"\",\"\",VLOOKUP(Q7,選手入力!$A$2:$B$202,2,FALSE))","v":""},5,0,0,0,0,0,"0000000",null,{"$f":"IF($B7=\"\",\"\",表紙!$B$34+リレー入力!$S7)","v":""},"",{"$f":"IF($B7=\"\",\"\",表紙!$B$4)","v":""},"",null,"",null,null,{"$f":"IF(I7=\"\",\"\",VLOOKUP(J7,選手入力!$B$2:$X$202,23,FALSE))","v":""},{"$f":"IF(K7=\"\",\"\",VLOOKUP(L7,選手入力!$B$2:$X$202,23,FALSE))","v":""},{"$f":"IF(M7=\"\",\"\",VLOOKUP(N7,選手入力!$B$2:$X$202,23,FALSE))","v":""},{"$f":"IF(O7=\"\",\"\",VLOOKUP(P7,選手入力!$B$2:$X$202,23,FALSE))","v":""},{"$f":"IF(Q7=\"\",\"\",VLOOKUP(R7,選手入力!$B$2:$X$202,23,FALSE))","v":""}]
[{"$nulls":9},{"$f":"IF(I8=\"\",\"\",VLOOKUP(I8,選手入力!$A$2:$B$202,2,FALSE))","v":""},null,{"$f":"IF(K8=\"\",\"\",VLOOKUP(K8,選手入力!$A$2:$B$202,2,FALSE))","v":""},null,{"$f":"IF(M8=\"\",\"\",VLOOKUP(M8,選手入力!$A$2:$B$202,2,FALSE))","v":""},null,{"$f":"IF(O8=\"\",\"\",VLOOKUP(O8,選手入力!$A$2:$B$202,2,FALSE))","v":""},null,{"$f":"IF(Q8=\"\",\"\",VLOOKUP(Q8,選手入力!$A$2:$B$202,2,FALSE))","v":""},6,0,0,0,0,0,"0000000",null,{"$f":"IF($B8=\"\",\"\",表紙!$B$34+リレー入力!$S8)","v":""},"",{"$f":"IF($B8=\"\",\"\",表紙!$B$4)","v":""},"",null,"",null,null,{"$f":"IF(I8=\"\",\"\",VLOOKUP(J8,選手入力!$B$2:$X$202,23,FALSE))","v":""},{"$f":"IF(K8=\"\",\"\",VLOOKUP(L8,選手入力!$B$2:$X$202,23,FALSE))","v":""},{"$f":"IF(M8=\"\",\"\",VLOOKUP(N8,選手入力!$B$2:$X$202,23,FALSE))","v":""},{"$f":"IF(O8=\"\",\"\",VLOOKUP(P8,選手入力!$B$2:$X$202,23,FALSE))","v":""},{"$f":"IF(Q8=\"\",\"\",VLOOKUP(R8,選手入力!$B$2:$X$202,23,FALSE))","v":""}]
[{"$nulls":9},{"$f":"IF(I9=\"\",\"\",VLOOKUP(I9,選手入力!$A$2:$B$202,2,FALSE))","v":""},null,{"$f":"IF(K9=\"\",\"\",VLOOKUP(K9,選手入力!$A$2:$B$202,2,FALSE))","v":""},null,{"$f":"IF(M9=\"\",\"\",VLOOKUP(M9,選手入力!$A$2:$B$202,2,FALSE))","v":""},null,{"$f":"IF(O9=\"\",\"\",VLOOKUP(O9,選手入力!$A$2:$B$202,2,FALSE))","v":""},null,{"$f":"IF(Q9=\"\",\"\",VLOOKUP(Q9,選手入力!$A$2:$B$202,2,FALSE))","v":""},7,0,0,0,0,0,"0000000",null,{"$f":"IF($B9=\"\",\"\",表紙!$B$34+リレー入力!$S9)","v":""},"",{"$f":"IF($B9=\"\",\"\",表紙!$B$4)","v":""},"",null,"",null,null,{"$f":"IF(I9=\"\",\"\",VLOOKUP(J9,選手入力!$B$2:$X$202,23,FALSE))","v":""},{"$f":"IF(K9=\"\",\"\",VLOOKUP(L9,選手入力!$B$2:$X$202,23,FALSE))","v":""},{"$f":"IF(M9=\"\",\"\",VLOOKUP(N9,選手入力!$B$2:$X$202,23,FALSE))","v":""},{"$f":"IF(O9=\"\",\"\",VLOOKUP(P9,選手入力!$B$2:$X$202,23,FALSE))","v":""},{"$f":"IF(Q9=\"\",\"\",VLOOKUP(R9,選手入力!$B$2:$X$202,23,FALSE))","v":""}]
[{"$nulls":9},{"$f":"IF(I10=\"\",\"\",VLOOKUP(I10,選手入力!$A$2:$B$202,2,FALSE))","v":""},null,{"$f":"IF(K10=\"\",\"\",VLOOKUP(K10,選手入力!$A$2:$B$202,2,FALSE))","v":""},null,{"$f":"IF(M10=\"\",\"\",VLOOKUP(M10,選手入力!$A$2:$B$202,2,FALSE))","v":""},null,{"$f":"IF(O10=\"\",\"\",VLOOKUP(O10,選手入力!$A$2:$B$202,2,FALSE))","v":""},null,{"$f":"IF(Q10=\"\",\"\",VLOOKUP(Q10,選手入力!$A$2:$B$202,2,FALSE))","v":""},8,0,0,0,0,0,"0000000",null,{"$f":"IF($B10=\"\",\"\",表紙!$B$34+リレー入力!$S10)","v":""},"",{"$f":"IF($B10=\"\",\"\",表紙!$B$4)","v":""},"",null,"",null,null,{"$f":"IF(I10=\"\",\"\",VLOOKUP(J10,選手入力!$B$2:$X$202,23,FALSE))","v":""},{"$f":"IF(K10=\"\",\"\",VLOOKUP(L10,選手入力!$B$2:$X$202,23,FALSE))","v":""},{"$f":"IF(M10=\"\",\"\",VLOOKUP(N10,選手入力!$B$2:$X$202,23,FALSE))","v":""},{"$f":"IF(O10=\"\",\"\",VLOOKUP(P10,選手入力!$B$2:$X$202,23,FALSE))","v":""},{"$f":"IF(Q10=\"\",\"\",VLOOKUP(R10,選手入力!$B$2:$X$202,23,FALSE))","v":""}]
[{"$nulls":9},{"$f":"IF(I11=\"\",\"\",VLOOKUP(I11,選手入力!$A$2:$B$202,2,FALSE))","v":""},null,{"$f":"IF(K11=\"\",\"\",VLOOKUP(K11,選手入力!$A$2:$B$202,2,FALSE))","v":""},null,{"$f":"IF(M11=\"\",\"\",VLOOKUP(M11,選手入力!$A$2:$B$202,2,FALSE))","v":""},null,{"$f":"IF(O11=\"\",\"\",VLOOKUP(O11,選手入力!$A$2:$B$202,2,FALSE))","v":""},null,{"$f":"IF(Q11=\"\",\"\",VLOOKUP(Q11,選手入力!$A$2:$B$202,2,FALSE))","v":""},9,0,0,0,0,0,"0000000",null,{"$f":"IF($B11=\"\",\"\",表紙!$B$34+リレー入力!$S11)","v":""},"",{"$f":"IF($B11=\"\",\"\",表紙!$B$4)","v":""},"",null,"",null,null,{"$f":"IF(I11=\"\",\"\",VLOOKUP(J11,選手入力!$B$2:$X$202,23,FALSE))","v":""},{"$f":"IF(K11=\"\",\"\",VLOOKUP(L11,選手入力!$B$2:$X$202,23,FALSE))","v":""},{"$f":"IF(M11=\"\",\"\",VLOOKUP(N11,選手入力!$B$2:$X$202,23,FALSE))","v":""},{"$f":"IF(O11=\"\",\"\",VLOOKUP(P11,選手入力!$B$2:$X$202,23,FALSE))","v":""},{"$f":"IF(Q11=\"\",\"\",VLOOKUP(R11,選手入力!$B$2:$X$202,23,FALSE))","v":""}]
[{"$nulls":9},{"$f":"IF(I12=\"\",\"\",VLOOKUP(I12,選手入力!$A$2:$B$202,2,FALSE))","v":""},null,{"$f":"IF(K12=\"\",\"\",VLOOKUP(K12,選手入力!$A$2:$B$202,2,FALSE))","v":""},null,{"$f":"IF(M12=\"\",\"\",VLOOKUP(M12,選手入力!$A$2:$B$202,2,FALSE))","v":""},null,{"$f":"IF(O12=\"\",\"\",VLOOKUP(O12,選手入力!$A$2:$B$202,2,FALSE))","v":""},null,{"$f":"IF(Q12=\"\",\"\",VLOOKUP(Q12,選手入力!$A$2:$B$202,2,FALSE))","v":""},10,0,0,0,0,0,"0000000",null,{"$f":"IF($B12=\"\",\"\",表紙!$B$34+リレー入力!$S12)","v":""},"",{"$f":"IF($B12=\"\",\"\",表紙!$B$4)","v":""},"",null,"",null,null,{"$f":"IF(I12=\"\",\"\",VLOOKUP(J12,選手入力!$B$2:$X$202,23,FALSE))","v":""},{"$f":"IF(K12=\"\",\"\",VLOOKUP(L12,選手入力!$B$2:$X$202,23,FALSE))","v":""},{"$f":"IF(M12=\"\",\"\",VLOOKUP(N12,選手入力!$B$2:$X$202,23,FALSE))","v":""},{"$f":"IF(O12=\"\",\"\",VLOOKUP(P12,選手入力!$B$2:$X$202,23,FALSE))","v":""},{"$f":"IF(Q12=\"\",\"\",VLOOKUP(R12,選手入力!$B$2:$X$202,23,FALSE))","v":""}]
[{"$nulls":9},{"$f":"IF(I13=\"\",\"\",VLOOKUP(I13,選手入力!$A$2:$B$202,2,FALSE))","v":""},null,{"$f":"IF(K13=\"\",\"\",VLOOKUP(K13,選手入力!$A$2:$B$202,2,FALSE))","v":""},null,{"$f":"IF(M13=\"\",\"\",VLOOKUP(M13,選手入力!$A$2:$B$202,2,FALSE))","v":""},null,{"$f":"IF(O13=\"\",\"\",VLOOKUP(O13,選手入力!$A$2:$B$202,2,FALSE))","v":""},null,{"$f":"IF(Q13=\"\",\"\",VLOOKUP(Q13,選手入力!$A$2:$B$202,2,FALSE))","v":""},11,0,0,0,0,0,"0000000",null,{"$f":"IF($B13=\"\",\"\",表紙!$B$34+リレー入力!$S13)","v":""},"",{"$f":"IF($B13=\"\",\"\",表紙!$B$4)","v":""},"",null,"",null,null,{"$f":"IF(I13=\"\",\"\",VLOOKUP(J13,選手入力!$B$2:$X$202,23,FALSE))","v":""},{"$f":"IF(K13=\"\",\"\",VLOOKUP(L13,選手入力!$B$2:$X$202,23,FALSE))","v":""},{"$f":"IF(M13=\"\",\"\",VLOOKUP(N13,選手入力!$B$2:$X$202,23,FALSE))","v":""},{"$f":"IF(O13=\"\",\"\",VLOOKUP(P13,選手入力!$B$2:$X$202,23,FALSE))","v":""},{"$f":"IF(Q13=\"\",\"\",VLOOKUP(R13,選手入力!$B$2:$X$202,23,FALSE))","v":""}]
[{"$nulls":9},{"$f":"IF(I14=\"\",\"\",VLOOKUP(I14,選手入力!$A$2:$B$202,2,FALSE))","v":""},null,{"$f":"IF(K14=\"\",\"\",VLOOKUP(K14,選手入力!$A$2:$B$202,2,FALSE))","v":""},null,{"$f":"IF(M14=\"\",\"\",VLOOKUP(M14,選手入力!$A$2:$B$202,2,FALSE))","v":""},null,{"$f":"IF(O14=\"\",\"\",VLOOKUP(O14,選手入力!$A$2:$B$202,2,FALSE))","v":""},null,{"$f":"IF(Q14=\"\",\"\",VLOOKUP(Q14,選手入力!$A$2:$B$202,2,FALSE))","v":""},12,0,0,0,0,0,"0000000",null,{"$f":"IF($B14=\"\",\"\",表紙!$B$34+リレー入力!$S14)","v":""},"",{"$f":"IF($B14=\"\",\"\",表紙!$B$4)","v":""},"",null,"",null,null,{"$f":"IF(I14=\"\",\"\",VLOOKUP(J14,選手入力!$B$2:$X$202,23,FALSE))","v":""},{"$f":"IF(K14=\"\",\"\",VLOOKUP(L14,選手入力!$B$2:$X$202,23,FALSE))","v":""},{"$f":"IF(M14=\"\",\"\",VLOOKUP(N14,選手入力!$B$2:$X$202,23,FALSE))","v":""},{"$f":"IF(O14=\"\",\"\",VLOOKUP(P14,選手入力!$B$2:$X$202,23,FALSE))","v":""},{"$f":"IF(Q14=\"\",\"\",VLOOKUP(R14,選手入力!$B$2:$X$202,23,FALSE))","v":""}]
[{"$nulls":9},{"$f":"IF(I15=\"\",\"\",VLOOKUP(I15,選手入力!$A$2:$B$202,2,FALSE))","v":""},null,{"$f":"IF(K15=\"\",\"\",VLOOKUP(K15,選手入力!$A$2:$B$202,2,FALSE))","v":""},null,{"$f":"IF(M15=\"\",\"\",VLOOKUP(M15,選手入力!$A$2:$B$202,2,FALSE))","v":""},null,{"$f":"IF(O15=\"\",\"\",VLOOKUP(O15,選手入力!$A$2:$B$202,2,FALSE))","v":""},null,{"$f":"IF(Q15=\"\",\"\",VLOOKUP(Q15,選手入力!$A$2:$B$202,2,FALSE))","v":""},13,0,0,0,0,0,"0000000",null,{"$f":"IF($B15=\"\",\"\",表紙!$B$34+リレー入力!$S15)","v":""},"",{"$f":"IF($B15=\"\",\"\",表紙!$B$4)","v":""},"",null,"",null,null,{"$f":"IF(I15=\"\",\"\",VLOOKUP(J15,選手入力!$B$2:$X$202,23,FALSE))","v":""},{"$f":"IF(K15=\"\",\"\",VLOOKUP(L15,選手入力!$B$2:$X$202,23,FALSE))","v":""},{"$f":"IF(M15=\"\",\"\",VLOOKUP(N15,選手入力!$B$2:$X$202,23,FALSE))","v":""},{"$f":"IF(O15=\"\",\"\",VLOOKUP(P15,選手入力!$B$2:$X$202,23,FALSE))","v":""},{"$f":"IF(Q15=\"\",\"\",VLOOKUP(R15,選手入力!$B$2:$X$202,23,FALSE))","v":""}]
{"$rows_left_out":68}
{"sheet":"学校データ","index":3,"n_rows":312,"n_cols":8,"rows_kept":312}
["学校コード","N1","N2","N3","KC",null,"選手初期NO","リレー初期NO"]
[101,"ﾏｴﾊﾞｼ.ﾓﾓﾉｲ","前橋市立桃井小学校","前・桃井",1,1,{"$f":"F2*1000","v":1000},{"$f":"F2*10","v":10}]
[102,"ﾏｴﾊﾞｼ.ﾅｶｶﾞﾜ","前橋市立中川小学校","前・中川",1,2,{"$f":"F3*1000","v":2000},{"$f":"F3*10","v":20}]
[103,"ﾏｴﾊﾞｼ.ｼｷｼﾏ","前橋市立敷島小学校","前・敷島",1,3,3000,30]
[104,"ﾏｴﾊﾞｼ.ｼﾞｮｳﾅﾝ","前橋市立城南小学校","前・城南",1,4,4000,40]
[105,"ﾏｴﾊﾞｼ.ｼﾞｮｳﾄｳ","前橋市立城東小学校","前・城東",1,5,5000,50]
[106,"ﾏｴﾊﾞｼ.ﾜｶﾐﾔ","前橋市立若宮小学校","前・若宮",1,6,6000,60]
[107,"ﾏｴﾊﾞｼ.ｱﾏｶﾞﾜ","前橋市立天川小学校","前・天川",1,7,7000,70]
[108,"ﾏｴﾊﾞｼ.ｲﾜｶﾞﾐ","前橋市立岩神小学校","前・岩神",1,8,8000,80]
[110,"ﾏｴﾊﾞｼ.ﾋﾛｾ","前橋市立広瀬小学校","前・広瀬",1,9,9000,90]
[111,"ﾏｴﾊﾞｼ.ｻﾝﾉｳ","前橋市立山王小学校","前・山王",1,10,10000,100]
[112,"ﾏｴﾊﾞｼ.ﾜｶﾊﾞ","前橋市立わかば小学校","前・わかば",1,11,11000,110]
[114,"ﾏｴﾊﾞｼ.ｶﾐｶﾜﾌﾁ","前橋市立上川淵小学校","前・上川淵",1,12,12000,120]
[115,"ﾏｴﾊﾞｼ.ｼﾓｶﾜﾌﾁ","前橋市立下川淵小学校","前・下川淵",1,13,13000,130]
[116,"ﾏｴﾊﾞｼ.ｶｲｶﾞﾔ","前橋市立桂萱小学校","前・桂萱",1,14,14000,140]
{"$rows_left_out":298}
{"sheet":"郡市データ","index":4,"n_rows":19,"n_cols":4,"rows_kept":19}
["郡市NO","郡市名","選手初期NO","リレー初期NO"]
[0,"な　し",{"$f":"A2*1000","v":0},{"$f":"A2*100","v":0}]
[1,"前　橋",{"$f":"A3*1000","v":1000},{"$f":"A3*100","v":100}]
[2,"伊勢崎",2000,200]
[3,"佐　波",3000,300]
[4,"北群馬",4000,400]
[5,"渋　川",5000,500]
[6,"利　根",6000,600]
[7,"沼　田",7000,700]
[8,"吾　妻",8000,800]
[9,"高　崎",9000,900]
[10,"安　中",10000,1000]
[11,"甘・富",11000,1100]
[12,"藤・多",12000,1200]
[13,"桐　生",13000,1300]
{"$rows_left_out":5}
{"sheet":"競技データ","index":5,"n_rows":29,"n_cols":13,"rows_kept":29}
["KC","N1","MX","R1","R2","R3","R4","R5","R6","R7","J1","J2","J3"]
["002   105","１００ｍ男子小学５年",0,"R0000000","R0000000","R0000000","R0000000","R0000000","R0000000","R0000000"]
["002   106","１００ｍ男子小学６年",0,"R0000000","R0000000","R0000000","R0000000","R0000000","R0000000","R0000000"]
["007   100","１０００ｍ男子小学５・６年",0,"R0000000","R0000000","R0000000","R0000000","R0000000","R0000000","R0000000"]
["042   100","５０ｍＨ男子小学５・６年",0,"R0000000","R0000000","R0000000","R0000000","R0000000","R0000000","R0000000"]
["002   107","１００ｍ男子小学友好レース",0,"R0000000","R0000000","R0000000","R0000000","R0000000","R0000000","R0000000"]
["601   100","４×１００ｍ男子小学５・６年",0,"R0000000","R0000000","R0000000","R0000000","R0000000","R0000000","R0000000"]
["071   100","走高跳男子小学５・６年",0,"R0000000","R0000000","R0000000","R0000000","R0000000","R0000000","R0000000"]
["073   100","走幅跳男子小学５・６年",0,"R0000000","R0000000","R0000000","R0000000","R0000000","R0000000","R0000000"]
["092   100","ボール投男子小学５・６年",0,"R0000000","R0000000","R0000000","R0000000","R0000000","R0000000","R0000000"]
["002   205","１００ｍ女子小学５年",0,"R0000000","R0000000","R0000000","R0000000","R0000000","R0000000","R0000000"]
["002   206","１００ｍ女子小学６年",0,"R0000000","R0000000","R0000000","R0000000","R0000000","R0000000","R0000000"]
["006   200","８００ｍ女子小学５・６年",0,"R0000000","R0000000","R0000000","R0000000","R0000000","R0000000","R0000000"]
["042   200","５０ｍＨ女子小学５・６年",0,"R0000000","R0000000","R0000000","R0000000","R0000000","R0000000","R0000000"]
["002   207","１００ｍ女子小学友好レース",0,"R0000000","R0000000","R0000000","R0000000","R0000000","R0000000","R0000000"]
{"$rows_left_out":14}